{"text_format":"1","workbook":"xlsx","n_sheets":5,"sheets":["Om verktøyet","ZERO-O Samlet beregning","Transport flerfunksjon","Tabellverdier","Lister"],"not_rendered":{"charts":7,"images":13,"macros":1,"external_links":2,"defined_names":80,"comments":0,"pivot_tables":0},"unopened":[],"bounds":{"document_bytes":16777216,"sheet_cells":100000,"rows_first":2000,"rows_last":500,"rows_between":2000,"halvings":0,"cell_chars":16384,"cell_head_chars":4096},"cells_cut":0,"cells_raw":0,"read":"whole","date_system":"1900"}

{"sheet":"Om verktøyet","index":0,"n_rows":24,"n_cols":3,"rows_kept":24,"cut":false,"hidden":false,"merged":[[2,1,2,11]]}
[]
[null,"Visualisteringsstøtte for sammenstilling av områdeprosjekter i FutureBuilt"]
[null,"\n Klimagassutslipp og karbonbinding knyttet til bygningers material- og energibruk. \nRegnearket benyttes til justering av beregningsresultater fra en NS3720-beregning. "]
[null,"Dette verktøyet viser samlet måloppnåelse for bygningsmasse (inkludert  grunn og fundamenter) transport, infrastruktur og landskap i et område"]
[null,"Verktøyet er utviklet av FutureBuilt og er tilpasset ZERO-O V1.2 (2024)"]
[null,"Første publikasjon: 20. juni  2025"]
[null,"Revidert: Ingen revisjon foreløpig"]
[]
[]
[]
[]
[null,"Om verktøyet"]
[]
[null,"Dette verktøyet er en visualisering av ZERO-O sin måloppnåelse for området som helhet. "]
[null,"Verktøyet beregner:"]
["1. ","Om 25 % av byggene (inkludert transport i drift), landskapene og infrastrukturen er fullverdige FutureBuilt forbildeprosjekter med 50 prosent utslippsreduksjon."]
[null,null,"Dette vises nederst i arkfanen i ZERO-O samlet beregning"]
[]
["2. ","Om området som helhet har minimum 25 prosent lavere klimagassutslipp enn Paris-kravene fra bygningsmasse, transport i drift, landskap og infrastruktur."]
[null,null,"Dette vises også nederst i arkfanen i ZERO-O samlet beregning"]
[]
[]
[null,"Man trenger å benytte eksterne eller verktøy utviklet av FutureBuilt i tillegg til dette excel-arket. "]
[null,"Hensikten med arket er å vise måloppnåelse opp mot ZERO-O Hovedkriterium."]

{"sheet":"ZERO-O Samlet beregning","index":1,"n_rows":247,"n_cols":29,"rows_kept":247,"cut":false,"hidden":false,"merged":[[14,1,21,1],[217,1,251,1],[28,2,31,2],[36,8,36,9],[36,10,36,11],[36,25,36,28],[20,4,21,8],[33,2,35,2],[222,2,222,9],[24,1,64,1],[118,1,153,1],[69,1,104,1],[168,1,206,1],[24,2,24,6],[123,8,123,9],[123,25,123,28],[75,8,75,9],[75,25,75,28],[175,8,175,9],[175,10,175,11],[175,25,175,28],[75,10,75,11],[227,10,227,11],[169,11,170,15],[225,2,225,11],[227,3,227,7],[227,8,227,9],[220,10,220,11],[221,2,221,9],[123,10,123,11]]}
[]
[null,null,"ZERO-O Samlet områdeberegning"]
[]
[null,null,"Regnearket benyttes for å visualisere og beregne samlet måloppnåelse i ZERO-O.",null,null,null,null,"Fyll inn gule felter"]
[null,null,"Du skal kun registrere data i gule felter.",null,null,null,null,"Grå felter beregnes automatisk"]
[null,null,"Fyll inn stegvis de ulike utslippskategoriene, med inndata hentet fra andre beregningsverktøy. ",null,null,null,null,"Midlertidige resultater"]
[null,null,null,null,null,null,null,"Krav"]
[null,null,"ZERO-O er obligatorisk for alle FutureBuilt forbildeområder. "]
[null,null,"Dersom ZERO-L eller ZERO-T velges som tilvalg i et forbildeområde, skal ambisjonene om utslippsreduksjon og forbildeareal økes til 50 %."]
[null,null,"Dersom det er beregnet over 50 % reduksjon i forhold til Paris-kravet i beregningene under, blir prosjektet automatisk satt som forbilde. "]
[null,null,"Den samlede beregningen henter ut verdier fra alle celler som er satt som \"Forbilde\""]
[null,null,"Dette feltet kan overstyres og settes som Forbilde manuelt, hvis det er en ambisjon om at prosjektet skal være et forbilde, uten å ha nådd 50 % reduksjon enda. "]
[]
[]
[null,null,"Prosjektinformasjon"]
[null,null,"Fyll inn prosjektinformasjon."]
[null,null,"Navn på område","Fyll inn"]
[null,null,"Beregningsdato","Fyll inn"]
[null,null,"Beregnet av","Fyll inn"]
[null,null,"Firma","Fyll inn"]
[null,null,"Beregningsperiode (år)",50,"NB: ZERO-metoden bruker 50 år. Tallet påvirker ikke resultatet i dette arket, men skal bekrefte at det er brukt 50 års beregningsperiode i inndataen lagt inn i samleberegningen. "]
[]
[]
[]
[null,"Bygningsmasse","Steg 1: Registrering av bygninger etter ZERO-B V3.1"]
[null,null,"Fyll ut gule felter i tabellen. "]
[null,null,"Fyll inn prosjektinformasjon, bygningstype, oppvarmet og BRA. "]
[]
[null,null,"Hvis tidlig fase:","Benytt beregningsverktøy for ZERO-O."]
[null,null,null,"Under arkfanen \"Bygningsmasse\" fyll inn arealer og bygningstype og spesifikt reduksjonsmål. "]
[null,null,null,"Under akfanen \"Klimabudsjett\" finner du klimabudsjettet for byggene dine. Fyll inn Klimabudsjett fra kollonne H og del på BRA. "]
[null,null,null,"Denne verdien fylles inn under \"Prosjektets beregnede utslipp\" i kollonne I under. "]
[]
[null,null,"Hvis senere faser: ","Reduzer beregner automatisk kravsnivå og prosjektets beregnede utslipp iht. ZERO-B V3.1 metodikken automatisk."]
[null,null,null,"Fyll da inn Prosjektets beregnede utslipp og FutureBuilt kravsnivå. Det kan brukes detaljerte beregninger eller automodell. "]
[null,null,null,"Modul for ZERO-B i OneClick arbeides med, og kommer trolig i løpet av årsskiftet 2025/2026. "]
[null,null,null,null,null,null,null,null,"kgCO2e/m2",null,"Viser måloppnåelsen",null,null,null,null,null,null,null,null,null,null,null,null,null,null,"% (Produksjon av figur)"]
[null,null,"Delområde/Byggetrinn","Prosjektnavn","Velg \nbygningstype","Type beregning","År\nferdigstillelse","Oppvarmet \nBRA","Prosjektets\nberegnede utslipp","FutureBuilt\nKravsnivå","Prosjektets \nreduksjon ift Pariskravet i %","Antatt\nForbilde",null,null,null,null,null,null,null,null,null,null,null,null,null,"Paris-kravet","Pariskravet","FB Kravsnivå","Prosjektets plassering kurve"]
[null,null,"Fyll inn","Fyll inn","Skolebygg","Tidlig design",2025,3500,180,200,{"$f":"IF(H39=\"\", \"\", 100 - I39 * 100 / Z39)","v":55},{"$f":"IF(K39=\"\", \"\", IF(K39>50, \"Forbilde\", \"Ikke forbilde\"))","v":"Forbilde"},null,null,null,null,null,null,null,null,null,null,null,null,null,{"$f":"J39*2","v":400},{"$f":"IF(G39=\"\", \"\", VLOOKUP(G39,Tabellverdier!$B$11:$C$42, 2, FALSE)*2)","v":74.999999999999972},{"$f":"IF(G39=\"\",\"\",VLOOKUP(G39,Tabellverdier!$B$11:$C$42,2,FALSE))","v":37.499999999999986},{"$f":"IF(H39=\"\", \"\", AA39-(AA39*K39)/100)","v":33.749999999999993}]
[null,null,"Fyll inn","Fyll inn","Kontor","Tidlig design",2028,5000,320,180,{"$f":"IF(H40=\"\", \"\", 100 - I40 * 100 / Z40)","v":11.111111111111114},{"$f":"IF(K40=\"\", \"\", IF(K40>50, \"Forbilde\", \"Ikke forbilde\"))","v":"Ikke forbilde"},null,null,null,null,null,null,null,null,null,null,null,null,null,{"$f":"J40*2","v":360},{"$f":"IF(G40=\"\", \"\", VLOOKUP(G40,Tabellverdier!$B$11:$C$42, 2, FALSE)*2)","v":59.999999999999964},{"$f":"IF(G40=\"\",\"\",VLOOKUP(G40,Tabellverdier!$B$11:$C$42,2,FALSE))","v":29.999999999999982},{"$f":"IF(H40=\"\", \"\", AA40-(AA40*K40)/100)","v":53.3333333333333}]
[null,null,"Fyll inn","Fyll inn","Boligblokk","Sen design",2032,5000,500,300,{"$f":"IF(H41=\"\", \"\", 100 - I41 * 100 / Z41)","v":16.666666666666671},"Ikke forbilde",null,null,null,null,null,null,null,null,null,null,null,null,null,{"$f":"J41*2","v":600},{"$f":"IF(G41=\"\", \"\", VLOOKUP(G41,Tabellverdier!$B$11:$C$42, 2, FALSE)*2)","v":46},{"$f":"IF(G41=\"\",\"\",VLOOKUP(G41,Tabellverdier!$B$11:$C$42,2,FALSE))","v":23},{"$f":"IF(H41=\"\", \"\", AA41-(AA41*K41)/100)","v":38.333333333333329}]
[null,null,null,null,"Boligblokk",null,null,null,null,null,{"$f":"IF(H42=\"\", \"\", 100 - I42 * 100 / Z42)","v":""},"",null,null,null,null,null,null,null,null,null,null,null,null,null,{"$f":"J42*2","v":0},{"$f":"IF(G42=\"\", \"\", VLOOKUP(G42,Tabellverdier!$B$11:$C$42, 2, FALSE)*2)","v":""},{"$f":"IF(G42=\"\",\"\",VLOOKUP(G42,Tabellverdier!$B$11:$C$42,2,FALSE))","v":""},{"$f":"IF(H42=\"\", \"\", AA42-(AA42*K42)/100)","v":""}]
[null,null,null,null,"Boligblokk",null,null,null,null,null,{"$f":"IF(H43=\"\", \"\", 100 - I43 * 100 / Z43)","v":""},"",null,null,null,null,null,null,null,null,null,null,null,null,null,{"$f":"J43*2","v":0},{"$f":"IF(G43=\"\", \"\", VLOOKUP(G43,Tabellverdier!$B$11:$C$42, 2, FALSE)*2)","v":""},{"$f":"IF(G43=\"\",\"\",VLOOKUP(G43,Tabellverdier!$B$11:$C$42,2,FALSE))","v":""},{"$f":"IF(H43=\"\", \"\", AA43-(AA43*K43)/100)","v":""}]
[null,null,null,null,null,null,null,null,null,null,{"$f":"IF(H44=\"\", \"\", 100 - I44 * 100 / Z44)","v":""},"",null,null,null,null,null,null,null,null,null,null,null,null,null,{"$f":"J44*2","v":0},{"$f":"IF(G44=\"\", \"\", VLOOKUP(G44,Tabellverdier!$B$11:$C$42, 2, FALSE)*2)","v":""},{"$f":"IF(G44=\"\",\"\",VLOOKUP(G44,Tabellverdier!$B$11:$C$42,2,FALSE))","v":""},{"$f":"IF(H44=\"\", \"\", AA44-(AA44*K44)/100)","v":""}]
[null,null,null,null,null,null,null,null,null,null,null,"",null,null,null,null,null,null,null,null,null,null,null,null,null,{"$f":"J45*2","v":0},{"$f":"IF(G45=\"\", \"\", VLOOKUP(G45,Tabellverdier!$B$11:$C$42, 2, FALSE)*2)","v":""},{"$f":"IF(G45=\"\",\"\",VLOOKUP(G45,Tabellverdier!$B$11:$C$42,2,FALSE))","v":""},{"$f":"IF(H45=\"\", \"\", AA45-(AA45*K45)/100)","v":""}]
[null,null,null,null,null,null,null,null,null,null,{"$f":"IF(H46=\"\", \"\", 100 - I46 * 100 / Z46)","v":""},"",null,null,null,null,null,null,null,null,null,null,null,null,null,{"$f":"J46*2","v":0},{"$f":"IF(G46=\"\", \"\", VLOOKUP(G46,Tabellverdier!$B$11:$C$42, 2, FALSE)*2)","v":""},{"$f":"IF(G46=\"\",\"\",VLOOKUP(G46,Tabellverdier!$B$11:$C$42,2,FALSE))","v":""},{"$f":"IF(H46=\"\", \"\", AA46-(AA46*K46)/100)","v":""}]
[null,null,null,null,null,null,null,null,null,null,{"$f":"IF(H47=\"\", \"\", 100 - I47 * 100 / Z47)","v":""},"",null,null,null,null,null,null,null,null,null,null,null,null,null,{"$f":"J47*2","v":0},{"$f":"IF(G47=\"\", \"\", VLOOKUP(G47,Tabellverdier!$B$11:$C$42, 2, FALSE)*2)","v":""},{"$f":"IF(G47=\"\",\"\",VLOOKUP(G47,Tabellverdier!$B$11:$C$42,2,FALSE))","v":""},{"$f":"IF(H47=\"\", \"\", AA47-(AA47*K47)/100)","v":""}]
[null,null,null,null,null,null,null,null,null,null,{"$f":"IF(H48=\"\", \"\", 100 - I48 * 100 / Z48)","v":""},"",null,null,null,null,null,null,null,null,null,null,null,null,null,{"$f":"J48*2","v":0},{"$f":"IF(G48=\"\", \"\", VLOOKUP(G48,Tabellverdier!$B$11:$C$42, 2, FALSE)*2)","v":""},{"$f":"IF(G48=\"\",\"\",VLOOKUP(G48,Tabellverdier!$B$11:$C$42,2,FALSE))","v":""},{"$f":"IF(H48=\"\", \"\", AA48-(AA48*K48)/100)","v":""}]
[null,null,null,null,null,null,null,null,null,null,{"$f":"IF(H49=\"\", \"\", 100 - I49 * 100 / Z49)","v":""},"",null,null,null,null,null,null,null,null,null,null,null,null,null,{"$f":"J49*2","v":0},{"$f":"IF(G49=\"\", \"\", VLOOKUP(G49,Tabellverdier!$B$11:$C$42, 2, FALSE)*2)","v":""},{"$f":"IF(G49=\"\",\"\",VLOOKUP(G49,Tabellverdier!$B$11:$C$42,2,FALSE))","v":""},{"$f":"IF(H49=\"\", \"\", AA49-(AA49*K49)/100)","v":""}]
[null,null,null,null,null,null,null,null,null,null,{"$f":"IF(H50=\"\", \"\", 100 - I50 * 100 / Z50)","v":""},"",null,null,null,null,null,null,null,null,null,null,null,null,null,{"$f":"J50*2","v":0},{"$f":"IF(G50=\"\", \"\", VLOOKUP(G50,Tabellverdier!$B$11:$C$42, 2, FALSE)*2)","v":""},{"$f":"IF(G50=\"\",\"\",VLOOKUP(G50,Tabellverdier!$B$11:$C$42,2,FALSE))","v":""},{"$f":"IF(H50=\"\", \"\", AA50-(AA50*K50)/100)","v":""}]
[null,null,null,null,null,null,null,null,null,null,{"$f":"IF(H51=\"\", \"\", 100 - I51 * 100 / Z51)","v":""},"",null,null,null,null,null,null,null,null,null,null,null,null,null,{"$f":"J51*2","v":0},{"$f":"IF(G51=\"\", \"\", VLOOKUP(G51,Tabellverdier!$B$11:$C$42, 2, FALSE)*2)","v":""},{"$f":"IF(G51=\"\",\"\",VLOOKUP(G51,Tabellverdier!$B$11:$C$42,2,FALSE))","v":""},{"$f":"IF(H51=\"\", \"\", AA51-(AA51*K51)/100)","v":""}]
[null,null,null,null,null,null,null,null,null,null,{"$f":"IF(H52=\"\", \"\", 100 - I52 * 100 / Z52)","v":""},"",null,null,null,null,null,null,null,null,null,null,null,null,null,{"$f":"J52*2","v":0},{"$f":"IF(G52=\"\", \"\", VLOOKUP(G52,Tabellverdier!$B$11:$C$42, 2, FALSE)*2)","v":""},{"$f":"IF(G52=\"\",\"\",VLOOKUP(G52,Tabellverdier!$B$11:$C$42,2,FALSE))","v":""},{"$f":"IF(H52=\"\", \"\", AA52-(AA52*K52)/100)","v":""}]
[null,null,null,null,null,null,null,null,null,null,{"$f":"IF(H53=\"\", \"\", 100 - I53 * 100 / Z53)","v":""},"",null,null,null,null,null,null,null,null,null,null,null,null,null,{"$f":"J53*2","v":0},{"$f":"IF(G53=\"\", \"\", VLOOKUP(G53,Tabellverdier!$B$11:$C$42, 2, FALSE)*2)","v":""},{"$f":"IF(G53=\"\",\"\",VLOOKUP(G53,Tabellverdier!$B$11:$C$42,2,FALSE))","v":""},{"$f":"IF(H53=\"\", \"\", AA53-(AA53*K53)/100)","v":""}]
[null,null,null,null,null,null,null,null,null,null,{"$f":"IF(H54=\"\", \"\", 100 - I54 * 100 / Z54)","v":""},"",null,null,null,null,null,null,null,null,null,null,null,null,null,{"$f":"J54*2","v":0},{"$f":"IF(G54=\"\", \"\", VLOOKUP(G54,Tabellverdier!$B$11:$C$42, 2, FALSE)*2)","v":""},{"$f":"IF(G54=\"\",\"\",VLOOKUP(G54,Tabellverdier!$B$11:$C$42,2,FALSE))","v":""},{"$f":"IF(H54=\"\", \"\", AA54-(AA54*K54)/100)","v":""}]
[null,null,null,null,null,null,null,null,null,null,{"$f":"IF(H55=\"\", \"\", 100 - I55 * 100 / Z55)","v":""},"",null,null,null,null,null,null,null,null,null,null,null,null,null,{"$f":"J55*2","v":0},{"$f":"IF(G55=\"\", \"\", VLOOKUP(G55,Tabellverdier!$B$11:$C$42, 2, FALSE)*2)","v":""},{"$f":"IF(G55=\"\",\"\",VLOOKUP(G55,Tabellverdier!$B$11:$C$42,2,FALSE))","v":""},{"$f":"IF(H55=\"\", \"\", AA55-(AA55*K55)/100)","v":""}]
[null,null,null,null,null,null,null,null,null,null,{"$f":"IF(H56=\"\", \"\", 100 - I56 * 100 / Z56)","v":""},"",null,null,null,null,null,null,null,null,null,null,null,null,null,{"$f":"J56*2","v":0},{"$f":"IF(G56=\"\", \"\", VLOOKUP(G56,Tabellverdier!$B$11:$C$42, 2, FALSE)*2)","v":""},{"$f":"IF(G56=\"\",\"\",VLOOKUP(G56,Tabellverdier!$B$11:$C$42,2,FALSE))","v":""},{"$f":"IF(H56=\"\", \"\", AA56-(AA56*K56)/100)","v":""}]
[null,null,null,null,null,null,null,null,null,null,{"$f":"IF(H57=\"\", \"\", 100 - I57 * 100 / Z57)","v":""},"",null,null,null,null,null,null,null,null,null,null,null,null,null,{"$f":"J57*2","v":0},{"$f":"IF(G57=\"\", \"\", VLOOKUP(G57,Tabellverdier!$B$11:$C$42, 2, FALSE)*2)","v":""},{"$f":"IF(G57=\"\",\"\",VLOOKUP(G57,Tabellverdier!$B$11:$C$42,2,FALSE))","v":""},{"$f":"IF(H57=\"\", \"\", AA57-(AA57*K57)/100)","v":""}]
[null,null,null,null,null,null,null,null,null,null,{"$f":"IF(H58=\"\", \"\", 100 - I58 * 100 / Z58)","v":""},"",null,null,null,null,null,null,null,null,null,null,null,null,null,{"$f":"J58*2","v":0},{"$f":"IF(G58=\"\", \"\", VLOOKUP(G58,Tabellverdier!$B$11:$C$42, 2, FALSE)*2)","v":""},{"$f":"IF(G58=\"\",\"\",VLOOKUP(G58,Tabellverdier!$B$11:$C$42,2,FALSE))","v":""},{"$f":"IF(H58=\"\", \"\", AA58-(AA58*K58)/100)","v":""}]
[null,null,"25 % av bygningsmassen skal være fullverdige forbildeprosjekter med 50 % utslippsreduksjon."]
[null,null,"Bygningsmassen samlet skal ha en utslippsreduksjon på 25 %."]
[]
[null,null,"Bygningsmassen","Resultat","Krav"]
[null,null,"Forbildeareal",{"$f":"D245*100/D244/100","v":0.2592592592592593},0.25]
[null,null,"CO2-reduksjon, vektet areal",{"$f":"SUMPRODUCT(H39:H58,K39:K58)/D244/100","v":0.24547325102880663},0.25]
[]
[]
[]
[]
[]
[null,"Transport","Steg 3: Registrering av transport etter ZERO-T V4.0"]
[null,null,"Fyll ut gule felter i tabellen og benytt ZERO-T V4.0 beregninsverktøy for å finne Prosjektets verdi og FutureBuilts mål"]
[null,null,"Prosjektets verdi - hvis prosjekteringsfase: hent data fra punkt 6. med alle prosjektets tiltak for mobilitet"]
[null,null,"Prosjektets verdi - hvis i drift: hent data fra punkt 7. med egen RVU"]
[null,null,"FutureBuilt Kravsnivå: hent data fra punkt 0: FutureBuilts mål"]
[null,null,"Hvis bygget er flerfunksjonelt, gå til arkfanen \"Transport flerfunksjon\" for å finne mellomberegningen. "]
[null,null,null,null,null,null,null,null,"kgCO2e/m2",null,"Viser måloppnåelsen",null,null,null,null,null,null,null,null,null,null,null,null,null,null,"% (Produksjon av figur)"]
[null,null,"Byggetrinn","Prosjektnavn","Velg \nbygningstype","Type beregning","År\nferdigstillelse","Oppvarmet \nBRA","Prosjektets\nverdi","FutureBuilts\nmål","Prosjektets \nreduksjon ift Pariskravet i %","Antatt\nForbilde",null,null,null,null,null,null,null,null,null,null,null,null,null,"Utslipp gitt ref.lokalisering","Pariskravet","FB Kravsnivå","Prosjektets plassering kurve"]
[null,null,"Fyll inn","Fyll inn","Skolebygg","Sen design",2026,3500,150,200,{"$f":"IF(H78=\"\", \"\", 100 - I78 * 100 / Z78)","v":62.5},{"$f":"IF(K78=\"\", \"\", IF(K78>50, \"Forbilde\", \"Ikke forbilde\"))","v":"Forbilde"},null,null,null,null,null,null,null,null,null,null,null,null,null,{"$f":"J78*2","v":400},{"$f":"IF(G78=\"\", \"\", VLOOKUP(G78,Tabellverdier!$B$11:$C$42, 2, FALSE)*2)","v":69.999999999999972},{"$f":"IF(G78=\"\",\"\",VLOOKUP(G78,Tabellverdier!$B$11:$C$42,2,FALSE))","v":34.999999999999986},{"$f":"IF(H78=\"\", \"\", AA78-(AA78*K78)/100)","v":26.249999999999993}]
[null,null,"Fyll inn","Fyll inn","Kontor","Tidlig design",2030,5000,450,{"$f":"'Transport flerfunksjon'!I44","v":266.66666666666669},{"$f":"IF(H79=\"\", \"\", 100 - I79 * 100 / Z79)","v":15.625},{"$f":"IF(K79=\"\", \"\", IF(K79>50, \"Forbilde\", \"Ikke forbilde\"))","v":"Ikke forbilde"},null,null,null,null,null,null,null,null,null,null,null,null,null,{"$f":"J79*2","v":533.33333333333337},{"$f":"IF(G79=\"\", \"\", VLOOKUP(G79,Tabellverdier!$B$11:$C$42, 2, FALSE)*2)","v":50},{"$f":"IF(G79=\"\",\"\",VLOOKUP(G79,Tabellverdier!$B$11:$C$42,2,FALSE))","v":25},{"$f":"IF(H79=\"\", \"\", AA79-(AA79*K79)/100)","v":42.1875}]
[null,null,"Fyll inn","Fyll inn","Boligblokk","Tidlig design",2035,5000,1000,600,{"$f":"IF(H80=\"\", \"\", 100 - I80 * 100 / Z80)","v":16.666666666666671},{"$f":"IF(K80=\"\", \"\", IF(K80>50, \"Forbilde\", \"Ikke forbilde\"))","v":"Ikke forbilde"},null,null,null,null,null,null,null,null,null,null,null,null,null,{"$f":"J80*2","v":1200},{"$f":"IF(G80=\"\", \"\", VLOOKUP(G80,Tabellverdier!$B$11:$C$42, 2, FALSE)*2)","v":39.999999999999993},{"$f":"IF(G80=\"\",\"\",VLOOKUP(G80,Tabellverdier!$B$11:$C$42,2,FALSE))","v":19.999999999999996},{"$f":"IF(H80=\"\", \"\", AA80-(AA80*K80)/100)","v":33.333333333333329}]
[null,null,null,null,null,null,null,null,null,0,{"$f":"IF(H81=\"\", \"\", 100 - I81 * 100 / Z81)","v":""},{"$f":"IF(K81=\"\", \"\", IF(K81>50, \"Forbilde\", \"Ikke forbilde\"))","v":""},null,null,null,null,null,null,null,null,null,null,null,null,null,{"$f":"J81*2","v":0},{"$f":"IF(G81=\"\", \"\", VLOOKUP(G81,Tabellverdier!$B$11:$C$42, 2, FALSE)*2)","v":""},{"$f":"IF(G81=\"\",\"\",VLOOKUP(G81,Tabellverdier!$B$11:$C$42,2,FALSE))","v":""},{"$f":"IF(H81=\"\", \"\", AA81-(AA81*K81)/100)","v":""}]
[null,null,null,null,null,null,null,null,null,0,{"$f":"IF(H82=\"\", \"\", 100 - I82 * 100 / Z82)","v":""},{"$f":"IF(K82=\"\", \"\", IF(K82>50, \"Forbilde\", \"Ikke forbilde\"))","v":""},null,null,null,null,null,null,null,null,null,null,null,null,null,{"$f":"J82*2","v":0},{"$f":"IF(G82=\"\", \"\", VLOOKUP(G82,Tabellverdier!$B$11:$C$42, 2, FALSE)*2)","v":""},{"$f":"IF(G82=\"\",\"\",VLOOKUP(G82,Tabellverdier!$B$11:$C$42,2,FALSE))","v":""},{"$f":"IF(H82=\"\", \"\", AA82-(AA82*K82)/100)","v":""}]
[null,null,null,null,null,null,null,null,null,0,{"$f":"IF(H83=\"\", \"\", 100 - I83 * 100 / Z83)","v":""},{"$f":"IF(K83=\"\", \"\", IF(K83>50, \"Forbilde\", \"Ikke forbilde\"))","v":""},null,null,null,null,null,null,null,null,null,null,null,null,null,{"$f":"J83*2","v":0},{"$f":"IF(G83=\"\", \"\", VLOOKUP(G83,Tabellverdier!$B$11:$C$42, 2, FALSE)*2)","v":""},{"$f":"IF(G83=\"\",\"\",VLOOKUP(G83,Tabellverdier!$B$11:$C$42,2,FALSE))","v":""},{"$f":"IF(H83=\"\", \"\", AA83-(AA83*K83)/100)","v":""}]
[null,null,null,null,null,null,null,null,null,0,{"$f":"IF(H84=\"\", \"\", 100 - I84 * 100 / Z84)","v":""},{"$f":"IF(K84=\"\", \"\", IF(K84>50, \"Forbilde\", \"Ikke forbilde\"))","v":""},null,null,null,null,null,null,null,null,null,null,null,null,null,{"$f":"J84*2","v":0},{"$f":"IF(G84=\"\", \"\", VLOOKUP(G84,Tabellverdier!$B$11:$C$42, 2, FALSE)*2)","v":""},{"$f":"IF(G84=\"\",\"\",VLOOKUP(G84,Tabellverdier!$B$11:$C$42,2,FALSE))","v":""},{"$f":"IF(H84=\"\", \"\", AA84-(AA84*K84)/100)","v":""}]
[null,null,null,null,null,null,null,null,null,0,{"$f":"IF(H85=\"\", \"\", 100 - I85 * 100 / Z85)","v":""},{"$f":"IF(K85=\"\", \"\", IF(K85>50, \"Forbilde\", \"Ikke forbilde\"))","v":""},null,null,null,null,null,null,null,null,null,null,null,null,null,{"$f":"J85*2","v":0},{"$f":"IF(G85=\"\", \"\", VLOOKUP(G85,Tabellverdier!$B$11:$C$42, 2, FALSE)*2)","v":""},{"$f":"IF(G85=\"\",\"\",VLOOKUP(G85,Tabellverdier!$B$11:$C$42,2,FALSE))","v":""},{"$f":"IF(H85=\"\", \"\", AA85-(AA85*K85)/100)","v":""}]
[null,null,null,null,null,null,null,null,null,0,{"$f":"IF(H86=\"\", \"\", 100 - I86 * 100 / Z86)","v":""},{"$f":"IF(K86=\"\", \"\", IF(K86>50, \"Forbilde\", \"Ikke forbilde\"))","v":""},null,null,null,null,null,null,null,null,null,null,null,null,null,{"$f":"J86*2","v":0},{"$f":"IF(G86=\"\", \"\", VLOOKUP(G86,Tabellverdier!$B$11:$C$42, 2, FALSE)*2)","v":""},{"$f":"IF(G86=\"\",\"\",VLOOKUP(G86,Tabellverdier!$B$11:$C$42,2,FALSE))","v":""},{"$f":"IF(H86=\"\", \"\", AA86-(AA86*K86)/100)","v":""}]
[null,null,null,null,null,null,null,null,null,0,{"$f":"IF(H87=\"\", \"\", 100 - I87 * 100 / Z87)","v":""},{"$f":"IF(K87=\"\", \"\", IF(K87>50, \"Forbilde\", \"Ikke forbilde\"))","v":""},null,null,null,null,null,null,null,null,null,null,null,null,null,{"$f":"J87*2","v":0},{"$f":"IF(G87=\"\", \"\", VLOOKUP(G87,Tabellverdier!$B$11:$C$42, 2, FALSE)*2)","v":""},{"$f":"IF(G87=\"\",\"\",VLOOKUP(G87,Tabellverdier!$B$11:$C$42,2,FALSE))","v":""},{"$f":"IF(H87=\"\", \"\", AA87-(AA87*K87)/100)","v":""}]
[null,null,null,null,null,null,null,null,null,0,{"$f":"IF(H88=\"\", \"\", 100 - I88 * 100 / Z88)","v":""},{"$f":"IF(K88=\"\", \"\", IF(K88>50, \"Forbilde\", \"Ikke forbilde\"))","v":""},null,null,null,null,null,null,null,null,null,null,null,null,null,{"$f":"J88*2","v":0},{"$f":"IF(G88=\"\", \"\", VLOOKUP(G88,Tabellverdier!$B$11:$C$42, 2, FALSE)*2)","v":""},{"$f":"IF(G88=\"\",\"\",VLOOKUP(G88,Tabellverdier!$B$11:$C$42,2,FALSE))","v":""},{"$f":"IF(H88=\"\", \"\", AA88-(AA88*K88)/100)","v":""}]
[null,null,null,null,null,null,null,null,null,0,{"$f":"IF(H89=\"\", \"\", 100 - I89 * 100 / Z89)","v":""},{"$f":"IF(K89=\"\", \"\", IF(K89>50, \"Forbilde\", \"Ikke forbilde\"))","v":""},null,null,null,null,null,null,null,null,null,null,null,null,null,{"$f":"J89*2","v":0},{"$f":"IF(G89=\"\", \"\", VLOOKUP(G89,Tabellverdier!$B$11:$C$42, 2, FALSE)*2)","v":""},{"$f":"IF(G89=\"\",\"\",VLOOKUP(G89,Tabellverdier!$B$11:$C$42,2,FALSE))","v":""},{"$f":"IF(H89=\"\", \"\", AA89-(AA89*K89)/100)","v":""}]
[null,null,null,null,null,null,null,null,null,0,{"$f":"IF(H90=\"\", \"\", 100 - I90 * 100 / Z90)","v":""},{"$f":"IF(K90=\"\", \"\", IF(K90>50, \"Forbilde\", \"Ikke forbilde\"))","v":""},null,null,null,null,null,null,null,null,null,null,null,null,null,{"$f":"J90*2","v":0},{"$f":"IF(G90=\"\", \"\", VLOOKUP(G90,Tabellverdier!$B$11:$C$42, 2, FALSE)*2)","v":""},{"$f":"IF(G90=\"\",\"\",VLOOKUP(G90,Tabellverdier!$B$11:$C$42,2,FALSE))","v":""},{"$f":"IF(H90=\"\", \"\", AA90-(AA90*K90)/100)","v":""}]
[null,null,null,null,null,null,null,null,null,0,{"$f":"IF(H91=\"\", \"\", 100 - I91 * 100 / Z91)","v":""},{"$f":"IF(K91=\"\", \"\", IF(K91>50, \"Forbilde\", \"Ikke forbilde\"))","v":""},null,null,null,null,null,null,null,null,null,null,null,null,null,{"$f":"J91*2","v":0},{"$f":"IF(G91=\"\", \"\", VLOOKUP(G91,Tabellverdier!$B$11:$C$42, 2, FALSE)*2)","v":""},{"$f":"IF(G91=\"\",\"\",VLOOKUP(G91,Tabellverdier!$B$11:$C$42,2,FALSE))","v":""},{"$f":"IF(H91=\"\", \"\", AA91-(AA91*K91)/100)","v":""}]
[null,null,null,null,null,null,null,null,null,0,{"$f":"IF(H92=\"\", \"\", 100 - I92 * 100 / Z92)","v":""},{"$f":"IF(K92=\"\", \"\", IF(K92>50, \"Forbilde\", \"Ikke forbilde\"))","v":""},null,null,null,null,null,null,null,null,null,null,null,null,null,{"$f":"J92*2","v":0},{"$f":"IF(G92=\"\", \"\", VLOOKUP(G92,Tabellverdier!$B$11:$C$42, 2, FALSE)*2)","v":""},{"$f":"IF(G92=\"\",\"\",VLOOKUP(G92,Tabellverdier!$B$11:$C$42,2,FALSE))","v":""},{"$f":"IF(H92=\"\", \"\", AA92-(AA92*K92)/100)","v":""}]
[null,null,null,null,null,null,null,null,null,0,{"$f":"IF(H93=\"\", \"\", 100 - I93 * 100 / Z93)","v":""},{"$f":"IF(K93=\"\", \"\", IF(K93>50, \"Forbilde\", \"Ikke forbilde\"))","v":""},null,null,null,null,null,null,null,null,null,null,null,null,null,{"$f":"J93*2","v":0},{"$f":"IF(G93=\"\", \"\", VLOOKUP(G93,Tabellverdier!$B$11:$C$42, 2, FALSE)*2)","v":""},{"$f":"IF(G93=\"\",\"\",VLOOKUP(G93,Tabellverdier!$B$11:$C$42,2,FALSE))","v":""},{"$f":"IF(H93=\"\", \"\", AA93-(AA93*K93)/100)","v":""}]
[null,null,null,null,null,null,null,null,null,0,{"$f":"IF(H94=\"\", \"\", 100 - I94 * 100 / Z94)","v":""},{"$f":"IF(K94=\"\", \"\", IF(K94>50, \"Forbilde\", \"Ikke forbilde\"))","v":""},null,null,null,null,null,null,null,null,null,null,null,null,null,{"$f":"J94*2","v":0},{"$f":"IF(G94=\"\", \"\", VLOOKUP(G94,Tabellverdier!$B$11:$C$42, 2, FALSE)*2)","v":""},{"$f":"IF(G94=\"\",\"\",VLOOKUP(G94,Tabellverdier!$B$11:$C$42,2,FALSE))","v":""},{"$f":"IF(H94=\"\", \"\", AA94-(AA94*K94)/100)","v":""}]
[null,null,null,null,null,null,null,null,null,0,{"$f":"IF(H95=\"\", \"\", 100 - I95 * 100 / Z95)","v":""},{"$f":"IF(K95=\"\", \"\", IF(K95>50, \"Forbilde\", \"Ikke forbilde\"))","v":""},null,null,null,null,null,null,null,null,null,null,null,null,null,{"$f":"J95*2","v":0},{"$f":"IF(G95=\"\", \"\", VLOOKUP(G95,Tabellverdier!$B$11:$C$42, 2, FALSE)*2)","v":""},{"$f":"IF(G95=\"\",\"\",VLOOKUP(G95,Tabellverdier!$B$11:$C$42,2,FALSE))","v":""},{"$f":"IF(H95=\"\", \"\", AA95-(AA95*K95)/100)","v":""}]
[null,null,null,null,null,null,null,null,null,0,{"$f":"IF(H96=\"\", \"\", 100 - I96 * 100 / Z96)","v":""},{"$f":"IF(K96=\"\", \"\", IF(K96>50, \"Forbilde\", \"Ikke forbilde\"))","v":""},null,null,null,null,null,null,null,null,null,null,null,null,null,{"$f":"J96*2","v":0},{"$f":"IF(G96=\"\", \"\", VLOOKUP(G96,Tabellverdier!$B$11:$C$42, 2, FALSE)*2)","v":""},{"$f":"IF(G96=\"\",\"\",VLOOKUP(G96,Tabellverdier!$B$11:$C$42,2,FALSE))","v":""},{"$f":"IF(H96=\"\", \"\", AA96-(AA96*K96)/100)","v":""}]
[null,null,null,null,null,null,null,null,null,0,{"$f":"IF(H97=\"\", \"\", 100 - I97 * 100 / Z97)","v":""},{"$f":"IF(K97=\"\", \"\", IF(K97>50, \"Forbilde\", \"Ikke forbilde\"))","v":""},null,null,null,null,null,null,null,null,null,null,null,null,null,{"$f":"J97*2","v":0},{"$f":"IF(G97=\"\", \"\", VLOOKUP(G97,Tabellverdier!$B$11:$C$42, 2, FALSE)*2)","v":""},{"$f":"IF(G97=\"\",\"\",VLOOKUP(G97,Tabellverdier!$B$11:$C$42,2,FALSE))","v":""},{"$f":"IF(H97=\"\", \"\", AA97-(AA97*K97)/100)","v":""}]
[]
[null,null,"25 % av bygningsmassens transportprosjekter skal være fullverdige forbildeprosjekter med 50 % utslippsreduksjon."]
[null,null,"Transportutslippene samlet skal ha en utslippsreduksjon på 25 %."]
[null,null,"Hvis ZERO-T velges som tilvalg skal utslippene fra transport ha en samlet reduksjon på 50 % og alle prosjektene være fullverdige forbildeprosjekter."]
[null,null,"Transport","Resultat","Krav","Hvis tilvalg"]
[null,null,"Forbildeareal",{"$f":"F245*100/F244/100","v":0.2592592592592593},0.25,0.5]
[null,null,"CO2-reduksjon",{"$f":"SUMPRODUCT(H78:H97,K78:K97)/F244/100","v":0.28163580246913583},0.25,0.5]
[]
[]
[]
[]
[]
[]
[]
[]
[]
[]
[]
[]
[]
[]
[null,"Landskap","Steg 2: Registrering av Landskap etter ZERO-L V1.3"]
[null,null,"Fyll ut gule felter i tabellen. "]
[null,null,"Bruk beregningsverktøy for ZERO-L for å finne prosjektets verdi og referanselandskapets utslipp."]
[null,null,"Veiledning for utfylling av ZERO-L verktøyet er beskrevet i ZERO-L. . "]
[null,null,"Reduzer har modul for  ZERO-L metodikk og kan benyttes. Det må lages både referanselandskap og et landskap med klimatiltak som to ulike versjoner. "]
[null,null,null,null,null,null,null,null,"kgCO2e/m2",null,"Viser måloppnåelsen",null,null,null,null,null,null,null,null,null,null,null,null,null,null,"% (Produksjon av figur)"]
[null,null,"Delområde/Byggetrinn","Prosjektnavn","Velg \nLandskapstype","Type beregning","År\nferdigstillelse","BRA","Prosjektets\nverdi","Referanse- landskap","Prosjektets \nreduksjon ift Pariskravet i %","Antatt\nForbilde",null,null,null,null,null,null,null,null,null,null,null,null,null,"FutureBuilt\nKravsnivå","Pariskravet","FB Kravsnivå","Prosjektets plassering kurve"]
[null,null,"Byggetrinn 1","Landskap 1","Park","Tidlig design",2030,4000,22,50,{"$f":"IF(H126=\"\", \"\", 100 - I126 * 100 / J126)","v":56},{"$f":"IF(K126=\"\", \"\", IF(K126>50, \"Forbilde\", \"Ikke forbilde\"))","v":"Forbilde"},null,null,null,null,null,null,null,null,null,null,null,null,null,{"$f":"J126/2","v":25},{"$f":"IF(G126=\"\", \"\", VLOOKUP(G126,Tabellverdier!$B$11:$C$42, 2, FALSE)*2)","v":50},{"$f":"IF(G126=\"\",\"\",VLOOKUP(G126,Tabellverdier!$B$11:$C$42,2,FALSE))","v":25},{"$f":"IF(H126=\"\", \"\", AA126-(AA126*K126)/100)","v":22}]
[null,null,"Byggetrinn 1","Landskap 2","Torg","Sen design",2032,5000,65,70,{"$f":"IF(H127=\"\", \"\", 100 - I127 * 100 / J127)","v":7.1428571428571388},{"$f":"IF(K127=\"\", \"\", IF(K127>50, \"Forbilde\", \"Ikke forbilde\"))","v":"Ikke forbilde"},null,null,null,null,null,null,null,null,null,null,null,null,null,{"$f":"J127/2","v":35},{"$f":"IF(G127=\"\", \"\", VLOOKUP(G127,Tabellverdier!$B$11:$C$42, 2, FALSE)*2)","v":46},{"$f":"IF(G127=\"\",\"\",VLOOKUP(G127,Tabellverdier!$B$11:$C$42,2,FALSE))","v":23},{"$f":"IF(H127=\"\", \"\", AA127-(AA127*K127)/100)","v":42.714285714285715}]
[null,null,"Byggetrinn 2","Landskap 3","Idrettsanlegg","Tidlig design",2037,5000,18,22,{"$f":"IF(H128=\"\", \"\", 100 - I128 * 100 / J128)","v":18.181818181818187},{"$f":"IF(K128=\"\", \"\", IF(K128>50, \"Forbilde\", \"Ikke forbilde\"))","v":"Ikke forbilde"},null,null,null,null,null,null,null,null,null,null,null,null,null,{"$f":"J128/2","v":11},{"$f":"IF(G128=\"\", \"\", VLOOKUP(G128,Tabellverdier!$B$11:$C$42, 2, FALSE)*2)","v":35.999999999999986},{"$f":"IF(G128=\"\",\"\",VLOOKUP(G128,Tabellverdier!$B$11:$C$42,2,FALSE))","v":17.999999999999993},{"$f":"IF(H128=\"\", \"\", AA128-(AA128*K128)/100)","v":29.454545454545439}]
[null,null,null,null,null,null,null,null,null,null,{"$f":"IF(H129=\"\", \"\", 100 - I129 * 100 / J129)","v":""},{"$f":"IF(K129=\"\", \"\", IF(K129>50, \"Forbilde\", \"Ikke forbilde\"))","v":""},null,null,null,null,null,null,null,null,null,null,null,null,null,{"$f":"J129/2","v":0},{"$f":"IF(G129=\"\", \"\", VLOOKUP(G129,Tabellverdier!$B$11:$C$42, 2, FALSE)*2)","v":""},{"$f":"IF(G129=\"\",\"\",VLOOKUP(G129,Tabellverdier!$B$11:$C$42,2,FALSE))","v":""},{"$f":"IF(H129=\"\", \"\", AA129-(AA129*K129)/100)","v":""}]
[null,null,null,null,null,null,null,null,null,null,"","",null,null,null,null,null,null,null,null,null,null,null,null,null,{"$f":"J130/2","v":0},{"$f":"IF(G130=\"\", \"\", VLOOKUP(G130,Tabellverdier!$B$11:$C$42, 2, FALSE)*2)","v":""},{"$f":"IF(G130=\"\",\"\",VLOOKUP(G130,Tabellverdier!$B$11:$C$42,2,FALSE))","v":""},{"$f":"IF(H130=\"\", \"\", AA130-(AA130*K130)/100)","v":""}]
[null,null,null,null,null,null,null,null,null,null,"","",null,null,null,null,null,null,null,null,null,null,null,null,null,{"$f":"J131/2","v":0},{"$f":"IF(G131=\"\", \"\", VLOOKUP(G131,Tabellverdier!$B$11:$C$42, 2, FALSE)*2)","v":""},{"$f":"IF(G131=\"\",\"\",VLOOKUP(G131,Tabellverdier!$B$11:$C$42,2,FALSE))","v":""},{"$f":"IF(H131=\"\", \"\", AA131-(AA131*K131)/100)","v":""}]
[null,null,null,null,null,null,null,null,null,null,"","",null,null,null,null,null,null,null,null,null,null,null,null,null,{"$f":"J132/2","v":0},{"$f":"IF(G132=\"\", \"\", VLOOKUP(G132,Tabellverdier!$B$11:$C$42, 2, FALSE)*2)","v":""},{"$f":"IF(G132=\"\",\"\",VLOOKUP(G132,Tabellverdier!$B$11:$C$42,2,FALSE))","v":""},{"$f":"IF(H132=\"\", \"\", AA132-(AA132*K132)/100)","v":""}]
[null,null,null,null,null,null,null,null,null,null,"","",null,null,null,null,null,null,null,null,null,null,null,null,null,{"$f":"J133/2","v":0},{"$f":"IF(G133=\"\", \"\", VLOOKUP(G133,Tabellverdier!$B$11:$C$42, 2, FALSE)*2)","v":""},{"$f":"IF(G133=\"\",\"\",VLOOKUP(G133,Tabellverdier!$B$11:$C$42,2,FALSE))","v":""},{"$f":"IF(H133=\"\", \"\", AA133-(AA133*K133)/100)","v":""}]
[null,null,null,null,null,null,null,null,null,null,"","",null,null,null,null,null,null,null,null,null,null,null,null,null,{"$f":"J134/2","v":0},{"$f":"IF(G134=\"\", \"\", VLOOKUP(G134,Tabellverdier!$B$11:$C$42, 2, FALSE)*2)","v":""},{"$f":"IF(G134=\"\",\"\",VLOOKUP(G134,Tabellverdier!$B$11:$C$42,2,FALSE))","v":""},{"$f":"IF(H134=\"\", \"\", AA134-(AA134*K134)/100)","v":""}]
[null,null,null,null,null,null,null,null,null,null,"","",null,null,null,null,null,null,null,null,null,null,null,null,null,{"$f":"J135/2","v":0},{"$f":"IF(G135=\"\", \"\", VLOOKUP(G135,Tabellverdier!$B$11:$C$42, 2, FALSE)*2)","v":""},{"$f":"IF(G135=\"\",\"\",VLOOKUP(G135,Tabellverdier!$B$11:$C$42,2,FALSE))","v":""},{"$f":"IF(H135=\"\", \"\", AA135-(AA135*K135)/100)","v":""}]
[null,null,null,null,null,null,null,null,null,null,"","",null,null,null,null,null,null,null,null,null,null,null,null,null,{"$f":"J136/2","v":0},{"$f":"IF(G136=\"\", \"\", VLOOKUP(G136,Tabellverdier!$B$11:$C$42, 2, FALSE)*2)","v":""},{"$f":"IF(G136=\"\",\"\",VLOOKUP(G136,Tabellverdier!$B$11:$C$42,2,FALSE))","v":""},{"$f":"IF(H136=\"\", \"\", AA136-(AA136*K136)/100)","v":""}]
[null,null,null,null,null,null,null,null,null,null,"","",null,null,null,null,null,null,null,null,null,null,null,null,null,{"$f":"J137/2","v":0},{"$f":"IF(G137=\"\", \"\", VLOOKUP(G137,Tabellverdier!$B$11:$C$42, 2, FALSE)*2)","v":""},{"$f":"IF(G137=\"\",\"\",VLOOKUP(G137,Tabellverdier!$B$11:$C$42,2,FALSE))","v":""},{"$f":"IF(H137=\"\", \"\", AA137-(AA137*K137)/100)","v":""}]
[null,null,null,null,null,null,null,null,null,null,"","",null,null,null,null,null,null,null,null,null,null,null,null,null,{"$f":"J138/2","v":0},{"$f":"IF(G138=\"\", \"\", VLOOKUP(G138,Tabellverdier!$B$11:$C$42, 2, FALSE)*2)","v":""},{"$f":"IF(G138=\"\",\"\",VLOOKUP(G138,Tabellverdier!$B$11:$C$42,2,FALSE))","v":""},{"$f":"IF(H138=\"\", \"\", AA138-(AA138*K138)/100)","v":""}]
[null,null,null,null,null,null,null,null,null,null,"","",null,null,null,null,null,null,null,null,null,null,null,null,null,{"$f":"J139/2","v":0},{"$f":"IF(G139=\"\", \"\", VLOOKUP(G139,Tabellverdier!$B$11:$C$42, 2, FALSE)*2)","v":""},{"$f":"IF(G139=\"\",\"\",VLOOKUP(G139,Tabellverdier!$B$11:$C$42,2,FALSE))","v":""},{"$f":"IF(H139=\"\", \"\", AA139-(AA139*K139)/100)","v":""}]
[null,null,null,null,null,null,null,null,null,null,"","",null,null,null,null,null,null,null,null,null,null,null,null,null,{"$f":"J140/2","v":0},{"$f":"IF(G140=\"\", \"\", VLOOKUP(G140,Tabellverdier!$B$11:$C$42, 2, FALSE)*2)","v":""},{"$f":"IF(G140=\"\",\"\",VLOOKUP(G140,Tabellverdier!$B$11:$C$42,2,FALSE))","v":""},{"$f":"IF(H140=\"\", \"\", AA140-(AA140*K140)/100)","v":""}]
[null,null,null,null,null,null,null,null,null,null,"","",null,null,null,null,null,null,null,null,null,null,null,null,null,{"$f":"J141/2","v":0},{"$f":"IF(G141=\"\", \"\", VLOOKUP(G141,Tabellverdier!$B$11:$C$42, 2, FALSE)*2)","v":""},{"$f":"IF(G141=\"\",\"\",VLOOKUP(G141,Tabellverdier!$B$11:$C$42,2,FALSE))","v":""},{"$f":"IF(H141=\"\", \"\", AA141-(AA141*K141)/100)","v":""}]
[null,null,null,null,null,null,null,null,null,null,"","",null,null,null,null,null,null,null,null,null,null,null,null,null,{"$f":"J142/2","v":0},{"$f":"IF(G142=\"\", \"\", VLOOKUP(G142,Tabellverdier!$B$11:$C$42, 2, FALSE)*2)","v":""},{"$f":"IF(G142=\"\",\"\",VLOOKUP(G142,Tabellverdier!$B$11:$C$42,2,FALSE))","v":""},{"$f":"IF(H142=\"\", \"\", AA142-(AA142*K142)/100)","v":""}]
[null,null,null,null,null,null,null,null,null,null,"","",null,null,null,null,null,null,null,null,null,null,null,null,null,{"$f":"J143/2","v":0},{"$f":"IF(G143=\"\", \"\", VLOOKUP(G143,Tabellverdier!$B$11:$C$42, 2, FALSE)*2)","v":""},{"$f":"IF(G143=\"\",\"\",VLOOKUP(G143,Tabellverdier!$B$11:$C$42,2,FALSE))","v":""},{"$f":"IF(H143=\"\", \"\", AA143-(AA143*K143)/100)","v":""}]
[null,null,null,null,null,null,null,null,null,null,"","",null,null,null,null,null,null,null,null,null,null,null,null,null,{"$f":"J144/2","v":0},{"$f":"IF(G144=\"\", \"\", VLOOKUP(G144,Tabellverdier!$B$11:$C$42, 2, FALSE)*2)","v":""},{"$f":"IF(G144=\"\",\"\",VLOOKUP(G144,Tabellverdier!$B$11:$C$42,2,FALSE))","v":""},{"$f":"IF(H144=\"\", \"\", AA144-(AA144*K144)/100)","v":""}]
[null,null,null,null,null,null,null,null,null,null,"","",null,null,null,null,null,null,null,null,null,null,null,null,null,{"$f":"J145/2","v":0},{"$f":"IF(G145=\"\", \"\", VLOOKUP(G145,Tabellverdier!$B$11:$C$42, 2, FALSE)*2)","v":""},{"$f":"IF(G145=\"\",\"\",VLOOKUP(G145,Tabellverdier!$B$11:$C$42,2,FALSE))","v":""},{"$f":"IF(H145=\"\", \"\", AA145-(AA145*K145)/100)","v":""}]
[]
[]
[null,null,"25 % av landskapene skal være fullverdige forbildeprosjekter med 50 % utslippsreduksjon."]
[null,null,"Landskapene samlet skal ha en utslippsreduksjon på 25 %."]
[null,null,"Hvis ZERO-L velges som tilvalg skal landskapene ha en samlet utslippsreduksjon på 50 % og alle landskapene være fullverdige forbildeprosjekter. "]
[null,null,"Landskap","Resultat","Krav","Hvis tilvalg"]
[null,null,"Forbildeareal",{"$f":"E245*100/E244/100","v":0.28571428571428575},0.25,0.5]
[null,null,"CO2-reduksjon, vektet areal",{"$f":"SUMPRODUCT(H126:H145,K126:K145)/E244/100","v":0.25044526901669761},0.25,0.5]
[]
[]
[]
[]
[]
[]
[]
[]
[]
[]
[]
[]
[]
[]
[]
[null,"Infrastruktur","Steg 4: Registrering av infrastruktur"]
[null,null,"Fyll ut gule felter i tabellen. "]
[null,null,"Det foreligger pdd. Ingen verktøy for beregning av infrastruktur. "]
[null,null,"For å beregne utslipp kan ZERO-B V3.0 beregningsverktøy benyttes."]
[null,null,"Referansen vil være et tilsvarende prosjekt med standard løsningsvalg. "]
[null,null,"ZERO-O beskriver veiledning for hvordan."]
[]
[null,null,null,null,null,null,null,null,"kgCO2e/m2",null,"Viser måloppnåelsen",null,null,null,null,null,null,null,null,null,null,null,null,null,null,"% (Produksjon av figur)"]
[null,null,"Byggetrinn","Byggetrinn","Type infrastruktur","Type beregning","År\nferdigstillelse","Løpemeter","Prosjektets\nverdi","Referanse infrastruktur","Prosjektets \nreduksjon ift Pariskravet i %","Antatt\nForbilde",null,null,null,null,null,null,null,null,null,null,null,null,null,"FutureBuilt\nKravsnivå","Pariskravet","FB Kravsnivå","Prosjektets plassering kurve"]
[null,null,"Byggetrinn 1","Infrastruktur 1","Annen infrastruktur","Sen design",2027,800,200,500,{"$f":"IF(J178=0, \"\", 100-I178*100/J178)","v":60},{"$f":"IF(K178=\"\", \"\", IF(K178>50, \"Forbilde\", \"Ikke forbilde\"))","v":"Forbilde"},null,null,null,null,null,null,null,null,null,null,null,null,null,{"$f":"J178/2","v":250},{"$f":"IF(G178=\"\", \"\", VLOOKUP(G178,Tabellverdier!$B$11:$C$42, 2, FALSE)*2)","v":64.999999999999972},{"$f":"IF(G178=\"\",\"\",VLOOKUP(G178,Tabellverdier!$B$11:$C$42,2,FALSE))","v":32.499999999999986},{"$f":"IF(G178=\"\", \"\", AA178-(AA178*K178)/100)","v":25.999999999999993}]
[null,null,"Byggetrinn 1","Infrastruktur 2","IKT","Sen design",2034,1000,900,1000,{"$f":"IF(J179=0, \"\", 100-I179*100/J179)","v":10},{"$f":"IF(K179=\"\", \"\", IF(K179>50, \"Forbilde\", \"Ikke forbilde\"))","v":"Ikke forbilde"},null,null,null,null,null,null,null,null,null,null,null,null,null,{"$f":"J179/2","v":500},{"$f":"IF(G179=\"\", \"\", VLOOKUP(G179,Tabellverdier!$B$11:$C$42, 2, FALSE)*2)","v":41.999999999999993},{"$f":"IF(G179=\"\",\"\",VLOOKUP(G179,Tabellverdier!$B$11:$C$42,2,FALSE))","v":20.999999999999996},{"$f":"IF(G179=\"\", \"\", AA179-(AA179*K179)/100)","v":37.799999999999997}]
[null,null,"Byggetrinn 2","Infrastruktur 3","Energi","Tidlig design",2040,1500,450,500,{"$f":"IF(J180=0, \"\", 100-I180*100/J180)","v":10},{"$f":"IF(K180=\"\", \"\", IF(K180>50, \"Forbilde\", \"Ikke forbilde\"))","v":"Ikke forbilde"},null,null,null,null,null,null,null,null,null,null,null,null,null,{"$f":"J180/2","v":250},{"$f":"IF(G180=\"\", \"\", VLOOKUP(G180,Tabellverdier!$B$11:$C$42, 2, FALSE)*2)","v":29.999999999999982},{"$f":"IF(G180=\"\",\"\",VLOOKUP(G180,Tabellverdier!$B$11:$C$42,2,FALSE))","v":14.999999999999991},{"$f":"IF(G180=\"\", \"\", AA180-(AA180*K180)/100)","v":26.999999999999986}]
[null,null,null,null,null,null,null,null,null,null,{"$f":"IF(J181=0, \"\", 100-I181*100/J181)","v":""},{"$f":"IF(K181=\"\", \"\", IF(K181>50, \"Forbilde\", \"Ikke forbilde\"))","v":""},null,null,null,null,null,null,null,null,null,null,null,null,null,{"$f":"J181/2","v":0},{"$f":"IF(G181=\"\", \"\", VLOOKUP(G181,Tabellverdier!$B$11:$C$42, 2, FALSE)*2)","v":""},{"$f":"IF(G181=\"\",\"\",VLOOKUP(G181,Tabellverdier!$B$11:$C$42,2,FALSE))","v":""},{"$f":"IF(G181=\"\", \"\", AA181-(AA181*K181)/100)","v":""}]
[null,null,null,null,null,null,null,null,null,null,"","",null,null,null,null,null,null,null,null,null,null,null,null,null,{"$f":"J182/2","v":0},{"$f":"IF(G182=\"\", \"\", VLOOKUP(G182,Tabellverdier!$B$11:$C$42, 2, FALSE)*2)","v":""},{"$f":"IF(G182=\"\",\"\",VLOOKUP(G182,Tabellverdier!$B$11:$C$42,2,FALSE))","v":""},{"$f":"IF(G182=\"\", \"\", AA182-(AA182*K182)/100)","v":""}]
[null,null,null,null,null,null,null,null,null,null,"","",null,null,null,null,null,null,null,null,null,null,null,null,null,{"$f":"J183/2","v":0},{"$f":"IF(G183=\"\", \"\", VLOOKUP(G183,Tabellverdier!$B$11:$C$42, 2, FALSE)*2)","v":""},{"$f":"IF(G183=\"\",\"\",VLOOKUP(G183,Tabellverdier!$B$11:$C$42,2,FALSE))","v":""},{"$f":"IF(G183=\"\", \"\", AA183-(AA183*K183)/100)","v":""}]
[null,null,null,null,null,null,null,null,null,null,"","",null,null,null,null,null,null,null,null,null,null,null,null,null,{"$f":"J184/2","v":0},{"$f":"IF(G184=\"\", \"\", VLOOKUP(G184,Tabellverdier!$B$11:$C$42, 2, FALSE)*2)","v":""},{"$f":"IF(G184=\"\",\"\",VLOOKUP(G184,Tabellverdier!$B$11:$C$42,2,FALSE))","v":""},{"$f":"IF(G184=\"\", \"\", AA184-(AA184*K184)/100)","v":""}]
[null,null,null,null,null,null,null,null,null,null,"","",null,null,null,null,null,null,null,null,null,null,null,null,null,{"$f":"J185/2","v":0},{"$f":"IF(G185=\"\", \"\", VLOOKUP(G185,Tabellverdier!$B$11:$C$42, 2, FALSE)*2)","v":""},{"$f":"IF(G185=\"\",\"\",VLOOKUP(G185,Tabellverdier!$B$11:$C$42,2,FALSE))","v":""},{"$f":"IF(G185=\"\", \"\", AA185-(AA185*K185)/100)","v":""}]
[null,null,null,null,null,null,null,null,null,null,"","",null,null,null,null,null,null,null,null,null,null,null,null,null,{"$f":"J186/2","v":0},{"$f":"IF(G186=\"\", \"\", VLOOKUP(G186,Tabellverdier!$B$11:$C$42, 2, FALSE)*2)","v":""},{"$f":"IF(G186=\"\",\"\",VLOOKUP(G186,Tabellverdier!$B$11:$C$42,2,FALSE))","v":""},{"$f":"IF(G186=\"\", \"\", AA186-(AA186*K186)/100)","v":""}]
[null,null,null,null,null,null,null,null,null,null,"","",null,null,null,null,null,null,null,null,null,null,null,null,null,{"$f":"J187/2","v":0},{"$f":"IF(G187=\"\", \"\", VLOOKUP(G187,Tabellverdier!$B$11:$C$42, 2, FALSE)*2)","v":""},{"$f":"IF(G187=\"\",\"\",VLOOKUP(G187,Tabellverdier!$B$11:$C$42,2,FALSE))","v":""},{"$f":"IF(G187=\"\", \"\", AA187-(AA187*K187)/100)","v":""}]
[null,null,null,null,null,null,null,null,null,null,"","",null,null,null,null,null,null,null,null,null,null,null,null,null,{"$f":"J188/2","v":0},{"$f":"IF(G188=\"\", \"\", VLOOKUP(G188,Tabellverdier!$B$11:$C$42, 2, FALSE)*2)","v":""},{"$f":"IF(G188=\"\",\"\",VLOOKUP(G188,Tabellverdier!$B$11:$C$42,2,FALSE))","v":""},{"$f":"IF(G188=\"\", \"\", AA188-(AA188*K188)/100)","v":""}]
[null,null,null,null,null,null,null,null,null,null,"","",null,null,null,null,null,null,null,null,null,null,null,null,null,{"$f":"J189/2","v":0},{"$f":"IF(G189=\"\", \"\", VLOOKUP(G189,Tabellverdier!$B$11:$C$42, 2, FALSE)*2)","v":""},{"$f":"IF(G189=\"\",\"\",VLOOKUP(G189,Tabellverdier!$B$11:$C$42,2,FALSE))","v":""},{"$f":"IF(G189=\"\", \"\", AA189-(AA189*K189)/100)","v":""}]
[null,null,null,null,null,null,null,null,null,null,"","",null,null,null,null,null,null,null,null,null,null,null,null,null,{"$f":"J190/2","v":0},{"$f":"IF(G190=\"\", \"\", VLOOKUP(G190,Tabellverdier!$B$11:$C$42, 2, FALSE)*2)","v":""},{"$f":"IF(G190=\"\",\"\",VLOOKUP(G190,Tabellverdier!$B$11:$C$42,2,FALSE))","v":""},{"$f":"IF(G190=\"\", \"\", AA190-(AA190*K190)/100)","v":""}]
[null,null,null,null,null,null,null,null,null,null,"","",null,null,null,null,null,null,null,null,null,null,null,null,null,{"$f":"J191/2","v":0},{"$f":"IF(G191=\"\", \"\", VLOOKUP(G191,Tabellverdier!$B$11:$C$42, 2, FALSE)*2)","v":""},{"$f":"IF(G191=\"\",\"\",VLOOKUP(G191,Tabellverdier!$B$11:$C$42,2,FALSE))","v":""},{"$f":"IF(G191=\"\", \"\", AA191-(AA191*K191)/100)","v":""}]
[null,null,null,null,null,null,null,null,null,null,"","",null,null,null,null,null,null,null,null,null,null,null,null,null,{"$f":"J192/2","v":0},{"$f":"IF(G192=\"\", \"\", VLOOKUP(G192,Tabellverdier!$B$11:$C$42, 2, FALSE)*2)","v":""},{"$f":"IF(G192=\"\",\"\",VLOOKUP(G192,Tabellverdier!$B$11:$C$42,2,FALSE))","v":""},{"$f":"IF(G192=\"\", \"\", AA192-(AA192*K192)/100)","v":""}]
[null,null,null,null,null,null,null,null,null,null,"","",null,null,null,null,null,null,null,null,null,null,null,null,null,{"$f":"J193/2","v":0},{"$f":"IF(G193=\"\", \"\", VLOOKUP(G193,Tabellverdier!$B$11:$C$42, 2, FALSE)*2)","v":""},{"$f":"IF(G193=\"\",\"\",VLOOKUP(G193,Tabellverdier!$B$11:$C$42,2,FALSE))","v":""},{"$f":"IF(G193=\"\", \"\", AA193-(AA193*K193)/100)","v":""}]
[null,null,null,null,null,null,null,null,null,null,"","",null,null,null,null,null,null,null,null,null,null,null,null,null,{"$f":"J194/2","v":0},{"$f":"IF(G194=\"\", \"\", VLOOKUP(G194,Tabellverdier!$B$11:$C$42, 2, FALSE)*2)","v":""},{"$f":"IF(G194=\"\",\"\",VLOOKUP(G194,Tabellverdier!$B$11:$C$42,2,FALSE))","v":""},{"$f":"IF(G194=\"\", \"\", AA194-(AA194*K194)/100)","v":""}]
[null,null,null,null,null,null,null,null,null,null,"","",null,null,null,null,null,null,null,null,null,null,null,null,null,{"$f":"J195/2","v":0},{"$f":"IF(G195=\"\", \"\", VLOOKUP(G195,Tabellverdier!$B$11:$C$42, 2, FALSE)*2)","v":""},{"$f":"IF(G195=\"\",\"\",VLOOKUP(G195,Tabellverdier!$B$11:$C$42,2,FALSE))","v":""},{"$f":"IF(G195=\"\", \"\", AA195-(AA195*K195)/100)","v":""}]
[null,null,null,null,null,null,null,null,null,null,"","",null,null,null,null,null,null,null,null,null,null,null,null,null,{"$f":"J196/2","v":0},{"$f":"IF(G196=\"\", \"\", VLOOKUP(G196,Tabellverdier!$B$11:$C$42, 2, FALSE)*2)","v":""},{"$f":"IF(G196=\"\",\"\",VLOOKUP(G196,Tabellverdier!$B$11:$C$42,2,FALSE))","v":""},{"$f":"IF(G196=\"\", \"\", AA196-(AA196*K196)/100)","v":""}]
[null,null,null,null,null,null,null,null,null,null,"","",null,null,null,null,null,null,null,null,null,null,null,null,null,{"$f":"J197/2","v":0},{"$f":"IF(G197=\"\", \"\", VLOOKUP(G197,Tabellverdier!$B$11:$C$42, 2, FALSE)*2)","v":""},{"$f":"IF(G197=\"\",\"\",VLOOKUP(G197,Tabellverdier!$B$11:$C$42,2,FALSE))","v":""},{"$f":"IF(G197=\"\", \"\", AA197-(AA197*K197)/100)","v":""}]
[]
[null,null,"25 % av infrastrukturen skal være fullverdige forbildeprosjekter med 50 % utslippsreduksjon."]
[null,null,"Infrastrukturutslippene samlet skal ha en utslippsreduksjon på 25 %."]
[]
[null,null,"Infrastruktur","Resultat","Krav"]
[null,null,"Forbildeareal",{"$f":"G245*100/G244/100","v":0.24242424242424243},0.25,"Viser hvor stor andel av infrastrukturprosjektene som er fullverdig forbildeprosjekt"]
[null,null,"CO2-reduksjon",{"$f":"SUMPRODUCT(H178:H197,K178:K197)/G244/100","v":0.22121212121212122},0.25,"Viser resultatet til infrastrukturprosjektene samlet etter vektet løpemeter"]
[]
[]
[]
[]
[]
[]
[]
[]
[]
[]
[]
[]
[]
[null,"Samlet resultat"]
[null,null,"Steg 5: Samlet måloppnåelse"]
[]
[null,null,"ZERO-O Hovedkriterium",null,null,null,null,null,null,null,"Måloppnåelse"]
[null,null,"1. I et FutureBuilt forbildeområde skal minst 25 prosent av bygg (inkludert transport i drift), landskap og infrastruktur være fullverdige FutureBuilt forbildeprosjekter",null,null,null,null,null,null,null,{"$f":"E234/D234","v":0.26636568848758463},0.25]
[null,null,"2. Området skal som helhet ha minimum 25 prosent lavere klimagassutslipp enn Paris-kravene fra bygningsmasse, transport i drift, landskap og infrastruktur.",null,null,null,null,null,null,null,{"$f":"J234","v":0.22717106412720611},0.25]
[]
[]
[]
[]
[null,null,null,"Arealer",null,null,null,null,"Utslippsreduksjoner samlet",null,"Totalutslipp (tonn)"]
[null,null,"Utslippskategorier","Samlet areal","Forbildeareal","Ikke forbildeareal","Krav forbildeareal","Resultat forbildeareal","Krav utslippsreduksjon","Resultat utslippsreduksjon","Område","Paris-kravet"]
[null,null,"Bygg",{"$f":"D244","v":13500},{"$f":"D245","v":3500},{"$f":"D230-E230","v":10000},0.25,{"$f":"(E230/D230)","v":0.25925925925925924},0.25,{"$f":"D64","v":0.24547325102880663},{"$f":"D246/1000","v":4730},{"$f":"D247/1000","v":6200},"tonn CO2e"]
[null,null,"Landskap",{"$f":"E244","v":14000},{"$f":"E245","v":4000},{"$f":"D231-E231","v":10000},0.25,{"$f":"(E231/D231)","v":0.2857142857142857},0.25,{"$f":"D153","v":0.25044526901669761},{"$f":"E246/1000","v":503},{"$f":"E247/1000","v":660},"tonn CO2e"]
[null,null,"Transport",{"$f":"F244","v":13500},{"$f":"F245","v":3500},{"$f":"D232-E232","v":10000},0.25,{"$f":"(E232/D232)","v":0.25925925925925924},0.25,{"$f":"D104","v":0.28163580246913583},{"$f":"F246/1000","v":7775},{"$f":"F247/1000","v":10066.666666666668},"tonn CO2e"]
[null,null,"Infrastruktur",{"$f":"G244","v":3300},{"$f":"G245","v":800},{"$f":"D233-E233","v":2500},0.25,{"$f":"(E233/D233)","v":0.24242424242424243},0.25,{"$f":"D204","v":0.22121212121212122},{"$f":"G246/1000","v":1735},{"$f":"G247/1000","v":2150},"tonn CO2e"]
[null,null,"Samlet",{"$f":"SUM(D230:D233)","v":44300},{"$f":"SUM(E230:E233)","v":11800},null,null,null,0.25,{"$f":"100%-K234/L234","v":0.22717106412720611},{"$f":"SUM(K230:K233)","v":14743},{"$f":"SUM(L230:L233)","v":19076.666666666668},"tonn CO2e"]
[]
[]
[]
[]
[]
[]
[]
[]
[null,null,null,"Bygningsmasse","Landskapet","Transport","Infrastruktur"]
[null,null,"Areal",{"$f":"SUM(H39:H58)","v":13500},{"$f":"SUM(H126:H145)","v":14000},{"$f":"SUM(H78:H97)","v":13500},{"$f":"SUM(H178:H197)","v":3300},"m2"]
[null,null,"Forbildeareal",{"$f":"SUMIF(L39:L58, \"Forbilde\", H39:H58)","v":3500},{"$f":"SUMIF(L126:L145, \"Forbilde\", H126:H145)","v":4000},{"$f":"SUMIF(L78:L97, \"Forbilde\", H78:H97)","v":3500},{"$f":"SUMIF(L178:L197, \"Forbilde\", H178:H197)","v":800},"m2"]
[null,null,"Totalutslipp prosjekter",{"$f":"SUMPRODUCT(I39:I58*H39:H58)","v":4730000},{"$f":"SUMPRODUCT(I126:I145*H126:H145)","v":503000},{"$f":"SUMPRODUCT(I78:I97*H78:H97)","v":7775000},{"$f":"SUMPRODUCT(I178:I197*H178:H197)","v":1735000},"kgCO2e"]
[null,null,"Total Pariskravet",{"$f":"SUMPRODUCT(Z39:Z58*H39:H58)","v":6200000},{"$f":"SUMPRODUCT(J126:J145*H126:H145)","v":660000},{"$f":"SUMPRODUCT(Z78:Z97*H78:H97)","v":10066666.666666668},{"$f":"SUMPRODUCT(J178:J197*H178:H197)","v":2150000},"kgCO2e"]

{"sheet":"Transport flerfunksjon","index":2,"n_rows":66,"n_cols":11,"rows_kept":66,"cut":false,"hidden":false,"merged":[]}
[]
[null,null,"Beregning for flerfunksjonelle byggningers transportutslipp"]
[]
[null,null,"Veiledning"]
[]
[null,null,null,"Fyll inn gule felter"]
[null,null,null,"Oransje felter gir inputverdier til ZERO-O Samlet beregning (steg 3)"]
[]
[null,null,"Dersom prosjektet ditt består av flere bygningstyper, skal disse ha tilpassede kravsnivå. Under kan du fylle inn opp til tre ulike bygningstyper."]
[null,null,"Fyll inn verdier fra resultatet av en ZERO-T V4 (publiseres 2025) beregning i tabellene under. "]
[null,null,"Feltet du skal hente ut data fra er nederst i ZERO-T beregningsverktøy og visgt i Figur 1."]
[null,null,"Lenke kommer: "]
[]
[null,null,"Velg bygningskategori fra nedtrekksmeny. Fyll inn oppvarmet BRA (m2)."]
[null,null,"Prosjektets verd i prosjekteringsfase: Bruk punkt 6. med alle prosjektets tiltak for mobilitet"]
[null,null,"Prosjektets verdi i drift: Bruk punkt 7. med egen RVU"]
[null,null,"FutureBuilt Kravsnivå: Bruk punkt 0 i tabellen \"FutureBuilts mål\""]
[null,null,"Velg flerfunksjonell i nedtrekksmenyen i områdeberegnigen og skriv over FB kravsnivå og Paris-kravet i tabellen for transportutslipp"]
[]
[null,null,"Figur 1: Figuren viser utklipp fra ZERO-T beregningsverktøy, hvor verdiene du skal bruke er nederst i beregningsverktøyet. "]
[]
[]
[]
[]
[]
[]
[]
[]
[]
[]
[]
[]
[]
[]
[]
[]
[]
[]
[null,null,"Første flerfunksjonelle bygning"]
[null,null,null,"Bygningstype 1","Bygningstype 2","Bygningstype 3",null,"Ferdigstillelsesår",2030]
[null,null,"Bygningstype","Kontor","Forretning/Næring",null,null,"Samlet areal",{"$f":"SUM(D42:F42)","v":1500},"m2"]
[null,null,"Oppvarmet bruksareal (BRA)",1000,500,null,null,"Prosjektets verdi",{"$f":"(D42*D43+E42*E43+F42*F43)/I41","v":166.66666666666666},"kgCO2e/m2","Input til Steg 3."]
[null,null,"Punkt 6 eller 7: Prosjektets verdi",200,100,null,null,"Pariskravet",{"$f":"I42*2","v":333.33333333333331},"kgCO2e/m2"]
[null,null,"Punkt 0: FutureBuilt kravsnivå",300,200,null,null,"FutureBuilts mål",{"$f":"(D42*D44+E42*E44+F42*F44)/I41","v":266.66666666666669},"kgCO2e/m2","Input til Steg 3."]
[]
[]
[]
[]
[null,null,"Andre flerfunksjonelle bygning"]
[null,null,null,"Bygningstype 1","Bygningstype 2","Bygningstype 3",null,"Ferdigstillelsesår",2035]
[null,null,"Bygningstype","Kontor","Forretning/Næring","Velg bygningstype",null,"Samlet areal",{"$f":"SUM(D52:F52)","v":6000},"m2"]
[null,null,"Oppvarmet bruksareal (BRA)",5000,1000,0,null,"Prosjektets verdi",{"$f":"(D52*D53+E52*E53+F52*F53)/I51","v":258.33333333333331},"kgCO2e/m2","Input til Steg 3."]
[null,null,"Punkt 6 eller 7: Prosjektets verdi",250,300,0,null,"Pariskravet",{"$f":"I52*2","v":516.66666666666663},"kgCO2e/m2"]
[null,null,"Punkt 0: FutureBuilt kravsnivå",300,300,0,null,"FutureBuilts mål",{"$f":"(D52*D54+E52*E54+F52*F54)/I51","v":300},"kgCO2e/m2","Input til Steg 3."]
[]
[]
[]
[]
[]
[]
[null,null,"Tredje flerfunksjonelle bygning"]
[null,null,null,"Bygningstype 1","Bygningstype 2","Bygningstype 3",null,"Ferdigstillelsesår",2030]
[null,null,"Bygningstype","Boligblokk","Forretning/Næring","Velg bygningstype",null,"Samlet areal",{"$f":"SUM(D64:F64)","v":2200},"m2"]
[null,null,"Oppvarmet bruksareal (BRA)",1000,500,700,null,"Prosjektets verdi",{"$f":"(D64*D65+E64*E65+F64*F65)/I63","v":177.27272727272728},"kgCO2e/m2","Input til Steg 3."]
[null,null,"Punkt 6 eller 7: Prosjektets verdi",200,100,200,null,"Pariskravet",{"$f":"I64*2","v":354.54545454545456},"kgCO2e/m2"]
[null,null,"Punkt 0: FutureBuilt kravsnivå",300,200,360,null,"FutureBuilts mål",{"$f":"(D64*D66+E64*E66+F64*F66)/I63","v":296.36363636363637},"kgCO2e/m2","Input til Steg 3."]

{"sheet":"Tabellverdier","index":3,"n_rows":42,"n_cols":8,"rows_kept":42,"cut":false,"hidden":false,"merged":[[9,2,9,3],[9,4,9,5],[9,6,9,7]]}
[]
[]
[null,"Beregning av Paris-kurven og linje for måloppnåelse"]
[]
[]
[]
[]
[]
[null,"Tabell 5: Beregner måloppnåelse opp mot pariskravet"]
[null,null,"Prosent",null,"Samlet måloppnåelse",null,"Krav"]
[null,null,"Paris-kravet","ZERO-ambisjon",null,{"$f":"\"Resultat: \"&TEXT('ZERO-O Samlet beregning'!K223,\"0,0%\")&\"\"","v":"Resultat: 22,7%"},null,"Områdemål: 25%"]
[null,2020,50,50,{"$f":"'ZERO-O Samlet beregning'!$J$234*100","v":22.717106412720611},{"$f":"C12+D12-E12","v":77.282893587279389},25,{"$f":"C12+D12-G12","v":75}]
[null,2021,47.5,47.5,{"$f":"E12-($E$12-$E$22)/10","v":21.581251092084582},{"$f":"C13+D13-E13","v":73.418748907915415},{"$f":"G12-($G$12-$G$22)/10","v":23.75},{"$f":"C13+D13-G13","v":71.25}]
[null,2022,44.999999999999993,44.999999999999993,{"$f":"E13-($E$12-$E$22)/10","v":20.445395771448553},69.554604228551426,{"$f":"G13-($G$12-$G$22)/10","v":22.5},67.499999999999986]
[null,2023,42.499999999999993,42.499999999999993,{"$f":"E14-($E$12-$E$22)/10","v":19.309540450812523},65.690459549187466,21.25,63.749999999999986]
[null,2024,39.999999999999993,39.999999999999993,18.173685130176494,61.826314869823491,20,59.999999999999986]
[null,2025,37.499999999999986,37.499999999999986,17.037829809540465,57.962170190459503,18.75,56.249999999999972]
[null,2026,34.999999999999986,34.999999999999986,15.901974488904434,54.098025511095535,17.5,52.499999999999972]
[null,2027,32.499999999999986,32.499999999999986,14.766119168268403,50.233880831731568,16.25,48.749999999999972]
[null,2028,29.999999999999982,29.999999999999982,13.630263847632373,46.369736152367594,15,44.999999999999964]
[null,2029,27.499999999999979,27.499999999999979,{"$f":"E20-($E$12-$E$22)/10","v":12.494408526996342},42.505591473003619,13.75,41.249999999999957]
[null,2030,25,25,{"$f":"E12/2","v":11.358553206360305},{"$f":"C22+D22-E22","v":38.641446793639695},{"$f":"G12/2","v":12.5},{"$f":"C22+D22-G22","v":37.5}]
[null,2031,24,24,{"$f":"E22-($E$22-$E$42)/20","v":10.904211078105893},37.095788921894105,{"$f":"G22-($G$22-$G$42)/20","v":12},36]
[null,2032,23,23,{"$f":"E23-($E$22-$E$42)/20","v":10.449868949851481},35.550131050148522,{"$f":"G23-($G$22-$G$42)/20","v":11.5},34.5]
[null,2033,21.999999999999996,21.999999999999996,9.9955268215970694,34.004473178402925,11,32.999999999999993]
[null,2034,20.999999999999996,20.999999999999996,9.5411846933426574,32.458815306657335,10.5,31.499999999999993]
[null,2035,19.999999999999996,19.999999999999996,9.0868425650882454,30.913157434911746,10,29.999999999999993]
[null,2036,18.999999999999993,18.999999999999993,8.6325004368338334,29.367499563166152,9.5,28.499999999999986]
[null,2037,17.999999999999993,17.999999999999993,8.1781583085794214,27.821841691420566,9,26.999999999999986]
[null,2038,16.999999999999993,16.999999999999993,7.7238161803250094,26.276183819674976,8.5,25.499999999999986]
[null,2039,15.999999999999993,15.999999999999993,7.2694740520705974,24.730525947929387,8,23.999999999999986]
[null,2040,14.999999999999991,14.999999999999991,6.8151319238161854,23.184868076183797,7.5,22.499999999999982]
[null,2041,13.999999999999989,13.999999999999989,6.3607897955617734,21.639210204438207,7,20.999999999999979]
[null,2042,12.999999999999989,12.999999999999989,5.9064476673073614,20.093552332692617,6.5,19.499999999999979]
[null,2043,11.999999999999989,11.999999999999989,5.4521055390529494,18.547894460947028,6,17.999999999999979]
[null,2044,10.999999999999991,10.999999999999991,4.9977634107985374,17.002236589201445,5.5,16.499999999999982]
[null,2045,9.9999999999999911,9.9999999999999911,4.5434212825441254,15.456578717455857,5,14.999999999999982]
[null,2046,8.9999999999999911,8.9999999999999911,4.0890791542897134,13.910920845710269,4.5,13.499999999999982]
[null,2047,7.999999999999992,7.999999999999992,3.6347370260353014,12.365262973964683,4,11.999999999999984]
[null,2048,6.999999999999992,6.999999999999992,3.1803948977808894,10.819605102219095,3.5,10.499999999999984]
[null,2049,5.999999999999992,5.999999999999992,2.7260527695264773,9.2739472304735067,3,8.999999999999984]
[null,2050,5,5,{"$f":"E12/10","v":2.2717106412720609},7.7282893587279391,{"$f":"G12/10","v":2.5},7.5]

{"sheet":"Lister","index":4,"n_rows":32,"n_cols":8,"rows_kept":32,"cut":false,"hidden":false,"merged":[]}
[]
[null,"Dette arket viser kun hva som inngår i nedtrekksmenyene i arket. "]
[null,"Bruker trenger ikke forholde seg til dette arket. "]
[]
[]
[]
[null,"Velg Prosjektfase",null,"Tidlig design",null,"Velg landskap",null,"Energi"]
[null,"Tidlig design",null,"Sen design",null,"Park",null,"Transport"]
[null,"Sen design",null,"Som bygget",null,"Gater",null,"VA"]
[null,"Som bygget",null,"I drift",null,"Torg",null,"Renovasjon"]
[null,null,null,null,null,"Idrettsanlegg",null,"IKT"]
[null,null,null,null,null,"Vannlandskap",null,"Annen infrastruktur"]
[null,"Velg bygningstype",null,null,null,"Gårdsrom/hager"]
[null,"Småhus",null,null,null,"Strandsone"]
[null,"Boligblokk"]
[null,"Barnehage"]
[null,"Skolebygg"]
[null,"Kontor"]
[null,"Universitet/Høyskole"]
[null,"Sykehus"]
[null,"Sykehjem"]
[null,"Hotellbygning"]
[null,"Idrettsbygning/Flerbrukshall"]
[null,"Forretning/Næring"]
[null,"Kulturbygning"]
[null,"Lett industri/Verksted"]
[null,"Flerfunksjonell"]
[]
[]
[]
[null,"Ja"]
[null,"Nei"]