{"text_format":"1","workbook":"xlsx","n_sheets":5,"sheets":["Om verktøyet","ZERO-O Samlet beregning","Transport flerfunksjon","Tabellverdier","Lister"],"not_rendered":{"charts":7,"images":13,"macros":1,"external_links":2,"defined_names":80,"comments":0,"pivot_tables":0},"unopened":[],"bounds":{"document_bytes":16777216,"sheet_cells":100000,"rows_first":2000,"rows_last":500,"rows_between":2000,"halvings":0,"cell_chars":16384,"cell_head_chars":4096},"cells_cut":0,"cells_raw":0,"read":"whole","date_system":"1900"}

{"sheet":"Om verktøyet","index":0,"n_rows":24,"n_cols":3,"rows_kept":24,"cut":false,"hidden":false,"merged":[[2,1,2,11]]}
[]
[null,"Visualisteringsstøtte for sammenstilling av områdeprosjekter i FutureBuilt"]
[null,"\n Klimagassutslipp og karbonbinding knyttet til bygningers material- og energibruk. \nRegnearket benyttes til justering av beregningsresultater fra en NS3720-beregning. "]
[null,"Dette verktøyet viser samlet måloppnåelse for bygningsmasse (inkludert  grunn og fundamenter) transport, infrastruktur og landskap i et område"]
[null,"Verktøyet er utviklet av FutureBuilt og er tilpasset ZERO-O V1.2 (2024)"]
[null,"Første publikasjon: 20. juni  2025"]
[null,"Revidert: Ingen revisjon foreløpig"]
[]
[]
[]
[]
[null,"Om verktøyet"]
[]
[null,"Dette verktøyet er en visualisering av ZERO-O sin måloppnåelse for området som helhet. "]
[null,"Verktøyet beregner:"]
["1. ","Om 25 % av byggene (inkludert transport i drift), landskapene og infrastrukturen er fullverdige FutureBuilt forbildeprosjekter med 50 prosent utslippsreduksjon."]
[null,null,"Dette vises nederst i arkfanen i ZERO-O samlet beregning"]
[]
["2. ","Om området som helhet har minimum 25 prosent lavere klimagassutslipp enn Paris-kravene fra bygningsmasse, transport i drift, landskap og infrastruktur."]
[null,null,"Dette vises også nederst i arkfanen i ZERO-O samlet beregning"]
[]
[]
[null,"Man trenger å benytte eksterne eller verktøy utviklet av FutureBuilt i tillegg til dette excel-arket. "]
[null,"Hensikten med arket er å vise måloppnåelse opp mot ZERO-O Hovedkriterium."]

{"sheet":"ZERO-O Samlet beregning","index":1,"n_rows":247,"n_cols":29,"rows_kept":247,"cut":false,"hidden":false,"merged":[[14,1,21,1],[217,1,251,1],[28,2,31,2],[36,8,36,9],[36,10,36,11],[36,25,36,28],[20,4,21,8],[33,2,35,2],[222,2,222,9],[24,1,64,1],[118,1,153,1],[69,1,104,1],[168,1,206,1],[24,2,24,6],[123,8,123,9],[123,25,123,28],[75,8,75,9],[75,25,75,28],[175,8,175,9],[175,10,175,11],[175,25,175,28],[75,10,75,11],[227,10,227,11],[169,11,170,15],[225,2,225,11],[227,3,227,7],[227,8,227,9],[220,10,220,11],[221,2,221,9],[123,10,123,11]]}
[]
[null,null,"ZERO-O Samlet områdeberegning"]
[]
[null,null,"Regnearket benyttes for å visualisere og beregne samlet måloppnåelse i ZERO-O.",null,null,null,null,"Fyll inn gule felter"]
[null,null,"Du skal kun registrere data i gule felter.",null,null,null,null,"Grå felter beregnes automatisk"]
[null,null,"Fyll inn stegvis de ulike utslippskategoriene, med inndata hentet fra andre beregningsverktøy. ",null,null,null,null,"Midlertidige resultater"]
[null,null,null,null,null,null,null,"Krav"]
[null,null,"ZERO-O er obligatorisk for alle FutureBuilt forbildeområder. "]
[null,null,"Dersom ZERO-L eller ZERO-T velges som tilvalg i et forbildeområde, skal ambisjonene om utslippsreduksjon og forbildeareal økes til 50 %."]
[null,null,"Dersom det er beregnet over 50 % reduksjon i forhold til Paris-kravet i beregningene under, blir prosjektet automatisk satt som forbilde. "]
[null,null,"Den samlede beregningen henter ut verdier fra alle celler som er satt som \"Forbilde\""]
[null,null,"Dette feltet kan overstyres og settes som Forbilde manuelt, hvis det er en ambisjon om at prosjektet skal være et forbilde, uten å ha nådd 50 % reduksjon enda. "]
[]
[]
[null,null,"Prosjektinformasjon"]
[null,null,"Fyll inn prosjektinformasjon."]
[null,null,"Navn på område","Fyll inn"]
[null,null,"Beregningsdato","Fyll inn"]
[null,null,"Beregnet av","Fyll inn"]
[null,null,"Firma","Fyll inn"]
[null,null,"Beregningsperiode (år)",50,"NB: ZERO-metoden bruker 50 år. Tallet påvirker ikke resultatet i dette arket, men skal bekrefte at det er brukt 50 års beregningsperiode i inndataen lagt inn i samleberegningen. "]
[]
[]
[]
[null,"Bygningsmasse","Steg 1: Registrering av bygninger etter ZERO-B V3.1"]
[null,null,"Fyll ut gule felter i tabellen. "]
[null,null,"Fyll inn prosjektinformasjon, bygningstype, oppvarmet og BRA. "]
[]
[null,null,"Hvis tidlig fase:","Benytt beregningsverktøy for ZERO-O."]
[null,null,null,"Under arkfanen \"Bygningsmasse\" fyll inn arealer og bygningstype og spesifikt reduksjonsmål. "]
[null,null,null,"Under akfanen \"Klimabudsjett\" finner du klimabudsjettet for byggene dine. Fyll inn Klimabudsjett fra kollonne H og del på BRA. "]
[null,null,null,"Denne verdien fylles inn under \"Prosjektets beregnede utslipp\" i kollonne I under. "]
[]
[null,null,"Hvis senere faser: ","Reduzer beregner automatisk kravsnivå og prosjektets beregnede utslipp iht. ZERO-B V3.1 metodikken automatisk."]
[null,null,null,"Fyll da inn Prosjektets beregnede utslipp og FutureBuilt kravsnivå. Det kan brukes detaljerte beregninger eller automodell. "]
[null,null,null,"Modul for ZERO-B i OneClick arbeides med, og kommer trolig i løpet av årsskiftet 2025/2026. "]
[null,null,null,null,null,null,null,null,"kgCO2e/m2",null,"Viser måloppnåelsen",null,null,null,null,null,null,null,null,null,null,null,null,null,null,"% (Produksjon av figur)"]
[null,null,"Delområde/Byggetrinn","Prosjektnavn","Velg \nbygningstype","Type beregning","År\nferdigstillelse","Oppvarmet \nBRA","Prosjektets\nberegnede utslipp","FutureBuilt\nKravsnivå","Prosjektets \nreduksjon ift Pariskravet i %","Antatt\nForbilde",null,null,null,null,null,null,null,null,null,null,null,null,null,"Paris-kravet","Pariskravet","FB Kravsnivå","Prosjektets plassering kurve"]
[null,null,"Fyll inn","Fyll inn","Skolebygg","Tidlig design",2025,3500,180,200,{"$f":"IF(H39=\"\", \"\", 100 - I39 * 100 / Z39)","v":55},{"$f":"IF(K39=\"\", \"\", IF(K39>50, \"Forbilde\", \"Ikke forbilde\"))","v":"Forbilde"},null,null,null,null,null,null,null,null,null,null,null,null,null,{"$f":"J39*2","v":400},{"$f":"IF(G39=\"\", \"\", VLOOKUP(G39,Tabellverdier!$B$11:$C$42, 2, FALSE)*2)","v":74.999999999999972},{"$f":"IF(G39=\"\",\"\",VLOOKUP(G39,Tabellverdier!$B$11:$C$42,2,FALSE))","v":37.499999999999986},{"$f":"IF(H39=\"\", \"\", AA39-(AA39*K39)/100)","v":33.749999999999993}]
[null,null,"Fyll inn","Fyll inn","Kontor","Tidlig design",2028,5000,320,180,{"$f":"IF(H40=\"\", \"\", 100 - I40 * 100 / Z40)","v":11.111111111111114},{"$f":"IF(K40=\"\", \"\", IF(K40>50, \"Forbilde\", \"Ikke forbilde\"))","v":"Ikke forbilde"},null,null,null,null,null,null,null,null,null,null,null,null,null,{"$f":"J40*2","v":360},{"$f":"IF(G40=\"\", \"\", VLOOKUP(G40,Tabellverdier!$B$11:$C$42, 2, FALSE)*2)","v":59.999999999999964},{"$f":"IF(G40=\"\",\"\",VLOOKUP(G40,Tabellverdier!$B$11:$C$42,2,FALSE))","v":29.999999999999982},{"$f":"IF(H40=\"\", \"\", AA40-(AA40*K40)/100)","v":53.3333333333333}]
[null,null,"Fyll inn","Fyll inn","Boligblokk","Sen design",2032,5000,500,300,{"$f":"IF(H41=\"\", \"\", 100 - I41 * 100 / Z41)","v":16.666666666666671},"Ikke forbilde",null,null,null,null,null,null,null,null,null,null,null,null,null,{"$f":"J41*2","v":600},{"$f":"IF(G41=\"\", \"\", VLOOKUP(G41,Tabellverdier!$B$11:$C$42, 2, FALSE)*2)","v":46},{"$f":"IF(G41=\"\",\"\",VLOOKUP(G41,Tabellverdier!$B$11:$C$42,2,FALSE))","v":23},{"$f":"IF(H41=\"\", \"\", AA41-(AA41*K41)/100)","v":38.333333333333329}]
[null,null,null,null,"Boligblokk",null,null,null,null,null,{"$f":"IF(H42=\"\", \"\", 100 - I42 * 100 / Z42)","v":""},"",null,null,null,null,null,null,null,null,null,null,null,null,null,{"$f":"J42*2","v":0},{"$f":"IF(G42=\"\", \"\", VLOOKUP(G42,Tabellverdier!$B$11:$C$42, 2, FALSE)*2)","v":""},{"$f":"IF(G42=\"\",\"\",VLOOKUP(G42,Tabellverdier!$B$11:$C$42,2,FALSE))","v":""},{"$f":"IF(H42=\"\", \"\", AA42-(AA42*K42)/100)","v":""}]
[null,null,null,null,"Boligblokk",null,null,null,null,null,{"$f":"IF(H43=\"\", \"\", 100 - I43 * 100 / Z43)","v":""},"",null,null,null,null,null,null,null,null,null,null,null,null,null,{"$f":"J43*2","v":0},{"$f":"IF(G43=\"\", \"\", VLOOKUP(G43,Tabellverdier!$B$11:$C$42, 2, FALSE)*2)","v":""},{"$f":"IF(G43=\"\",\"\",VLOOKUP(G43,Tabellverdier!$B$11:$C$42,2,FALSE))","v":""},{"$f":"IF(H43=\"\", \"\", AA43-(AA43*K43)/100)","v":""}]
[null,null,null,null,null,null,null,null,null,null,{"$f":"IF(H44=\"\", \"\", 100 - I44 * 100 / Z44)","v":""},"",null,null,null,null,null,null,null,null,null,null,null,null,null,{"$f":"J44*2","v":0},{"$f":"IF(G44=\"\", \"\", VLOOKUP(G44,Tabellverdier!$B$11:$C$42, 2, FALSE)*2)","v":""},{"$f":"IF(G44=\"\",\"\",VLOOKUP(G44,Tabellverdier!$B$11:$C$42,2,FALSE))","v":""},{"$f":"IF(H44=\"\", \"\", AA44-(AA44*K44)/100)","v":""}]
[null,null,null,null,null,null,null,null,null,null,null,"",null,null,null,null,null,null,null,null,null,null,null,null,null,{"$f":"J45*2","v":0},{"$f":"IF(G45=\"\", \"\", VLOOKUP(G45,Tabellverdier!$B$11:$C$42, 2, FALSE)*2)","v":""},{"$f":"IF(G45=\"\",\"\",VLOOKUP(G45,Tabellverdier!$B$11:$C$42,2,FALSE))","v":""},{"$f":"IF(H45=\"\", \"\", AA45-(AA45*K45)/100)","v":""}]
[null,null,null,null,null,null,null,null,null,null,{"$f":"IF(H46=\"\", \"\", 100 - I46 * 100 / Z46)","v":""},"",null,null,null,null,null,null,null,null,null,null,null,null,null,{"$f":"J46*2","v":0},{"$f":"IF(G46=\"\", \"\", VLOOKUP(G46,Tabellverdier!$B$11:$C$42, 2, FALSE)*2)","v":""},{"$f":"IF(G46=\"\",\"\",VLOOKUP(G46,Tabellverdier!$B$11:$C$42,2,FALSE))","v":""},{"$f":"IF(H46=\"\", \"\", AA46-(AA46*K46)/100)","v":""}]
[null,null,null,null,null,null,null,null,null,null,{"$f":"IF(H47=\"\", \"\", 100 - I47 * 100 / Z47)","v":""},"",null,null,null,null,null,null,null,null,null,null,null,null,null,{"$f":"J47*2","v":0},{"$f":"IF(G47=\"\", \"\", VLOOKUP(G47,Tabellverdier!$B$11:$C$42, 2, FALSE)*2)","v":""},{"$f":"IF(G47=\"\",\"\",VLOOKUP(G47,Tabellverdier!$B$11:$C$42,2,FALSE))","v":""},{"$f":"IF(H47=\"\", \"\", AA47-(AA47*K47)/100)","v":""}]
[null,null,null,null,null,null,null,null,null,null,{"$f":"IF(H48=\"\", \"\", 100 - I48 * 100 / Z48)","v":""},"",null,null,null,null,null,null,null,null,null,null,null,null,null,{"$f":"J48*2","v":0},{"$f":"IF(G48=\"\", \"\", VLOOKUP(G48,Tabellverdier!$B$11:$C$42, 2, FALSE)*2)","v":""},{"$f":"IF(G48=\"\",\"\",VLOOKUP(G48,Tabellverdier!$B$11:$C$42,2,FALSE))","v":""},{"$f":"IF(H48=\"\", \"\", AA48-(AA48*K48)/100)","v":""}]
[null,null,null,null,null,null,null,null,null,null,{"$f":"IF(H49=\"\", \"\", 100 - I49 * 100 / Z49)","v":""},"",null,null,null,null,null,null,null,null,null,null,null,null,null,{"$f":"J49*2","v":0},{"$f":"IF(G49=\"\", \"\", VLOOKUP(G49,Tabellverdier!$B$11:$C$42, 2, FALSE)*2)","v":""},{"$f":"IF(G49=\"\",\"\",VLOOKUP(G49,Tabellverdier!$B$11:$C$42,2,FALSE))","v":""},{"$f":"IF(H49=\"\", \"\", AA49-(AA49*K49)/100)","v":""}]
[null,null,null,null,null,null,null,null,null,null,{"$f":"IF(H50=\"\", \"\", 100 - I50 * 100 / Z50)","v":""},"",null,null,null,null,null,null,null,null,null,null,null,null,null,{"$f":"J50*2","v":0},{"$f":"IF(G50=\"\", \"\", VLOOKUP(G50,Tabellverdier!$B$11:$C$42, 2, FALSE)*2)","v":""},{"$f":"IF(G50=\"\",\"\",VLOOKUP(G50,Tabellverdier!$B$11:$C$42,2,FALSE))","v":""},{"$f":"IF(H50=\"\", \"\", AA50-(AA50*K50)/100)","v":""}]
[null,null,null,null,null,null,null,null,null,null,{"$f":"IF(H51=\"\", \"\", 100 - I51 * 100 / Z51)","v":""},"",null,null,null,null,null,null,null,null,null,null,null,null,null,{"$f":"J51*2","v":0},{"$f":"IF(G51=\"\", \"\", VLOOKUP(G51,Tabellverdier!$B$11:$C$42, 2, FALSE)*2)","v":""},{"$f":"IF(G51=\"\",\"\",VLOOKUP(G51,Tabellverdier!$B$11:$C$42,2,FALSE))","v":""},{"$f":"IF(H51=\"\", \"\", AA51-(AA51*K51)/100)","v":""}]
[null,null,null,null,null,null,null,null,null,null,{"$f":"IF(H52=\"\", \"\", 100 - I52 * 100 / Z52)","v":""},"",null,null,null,null,null,null,null,null,null,null,null,null,null,{"$f":"J52*2","v":0},{"$f":"IF(G52=\"\", \"\", VLOOKUP(G52,Tabellverdier!$B$11:$C$42, 2, FALSE)*2)","v":""},{"$f":"IF(G52=\"\",\"\",VLOOKUP(G52,Tabellverdier!$B$11:$C$42,2,FALSE))","v":""},{"$f":"IF(H52=\"\", \"\", AA52-(AA52*K52)/100)","v":""}]
[null,null,null,null,null,null,null,null,null,null,{"$f":"IF(H53=\"\", \"\", 100 - I53 * 100 / Z53)","v":""},"",null,null,null,null,null,null,null,null,null,null,null,null,null,{"$f":"J53*2","v":0},{"$f":"IF(G53=\"\", \"\", VLOOKUP(G53,Tabellverdier!$B$11:$C$42, 2, FALSE)*2)","v":""},{"$f":"IF(G53=\"\",\"\",VLOOKUP(G53,Tabellverdier!$B$11:$C$42,2,FALSE))","v":""},{"$f":"IF(H53=\"\", \"\", AA53-(AA53*K53)/100)","v":""}]
[null,null,null,null,null,null,null,null,null,null,{"$f":"IF(H54=\"\", \"\", 100 - I54 * 100 / Z54)","v":""},"",null,null,null,null,null,null,null,null,null,null,null,null,null,{"$f":"J54*2","v":0},{"$f":"IF(G54=\"\", \"\", VLOOKUP(G54,Tabellverdier!$B$11:$C$42, 2, FALSE)*2)","v":""},{"$f":"IF(G54=\"\",\"\",VLOOKUP(G54,Tabellverdier!$B$11:$C$42,2,FALSE))","v":""},{"$f":"IF(H54=\"\", \"\", AA54-(AA54*K54)/100)","v":""}]
[null,null,null,null,null,null,null,null,null,null,{"$f":"IF(H55=\"\", \"\", 100 - I55 * 100 / Z55)","v":""},"",null,null,null,null,null,null,null,null,null,null,null,null,null,{"$f":"J55*2","v":0},{"$f":"IF(G55=\"\", \"\", VLOOKUP(G55,Tabellverdier!$B$11:$C$42, 2, FALSE)*2)","v":""},{"$f":"IF(G55=\"\",\"\",VLOOKUP(G55,Tabellverdier!$B$11:$C$42,2,FALSE))","v":""},{"$f":"IF(H55=\"\", \"\", AA55-(AA55*K55)/100)","v":""}]
[null,null,null,null,null,null,null,null,null,null,{"$f":"IF(H56=\"\", \"\", 100 - I56 * 100 / Z56)","v":""},"",null,null,null,null,null,null,null,null,null,null,null,null,null,{"$f":"J56*2","v":0},{"$f":"IF(G56=\"\", \"\", VLOOKUP(G56,Tabellverdier!$B$11:$C$42, 2, FALSE)*2)","v":""},{"$f":"IF(G56=\"\",\"\",VLOOKUP(G56,Tabellverdier!$B$11:$C$42,2,FALSE))","v":""},{"$f":"IF(H56=\"\", \"\", AA56-(AA56*K56)/100)","v":""}]
[null,null,null,null,null,null,null,null,null,null,{"$f":"IF(H57=\"\", \"\", 100 - I57 * 100 / Z57)","v":""},"",null,null,null,null,null,null,null,null,null,null,null,null,null,{"$f":"J57*2","v":0},{"$f":"IF(G57=\"\", \"\", VLOOKUP(G57,Tabellverdier!$B$11:$C$42, 2, FALSE)*2)","v":""},{"$f":"IF(G57=\"\",\"\",VLOOKUP(G57,Tabellverdier!$B$11:$C$42,2,FALSE))","v":""},{"$f":"IF(H57=\"\", \"\", AA57-(AA57*K57)/100)","v":""}]
[null,null,null,null,null,null,null,null,null,null,{"$f":"IF(H58=\"\", \"\", 100 - I58 * 100 / Z58)","v":""},"",null,null,null,null,null,null,null,null,null,null,null,null,null,{"$f":"J58*2","v":0},{"$f":"IF(G58=\"\", \"\", VLOOKUP(G58,Tabellverdier!$B$11:$C$42, 2, FALSE)*2)","v":""},{"$f":"IF(G58=\"\",\"\",VLOOKUP(G58,Tabellverdier!$B$11:$C$42,2,FALSE))","v":""},{"$f":"IF(H58=\"\", \"\", AA58-(AA58*K58)/100)","v":""}]
[null,null,"25 % av bygningsmassen skal være fullverdige forbildeprosjekter med 50 % utslippsreduksjon."]
[null,null,"Bygningsmassen samlet skal ha en utslippsreduksjon på 25 %."]
{"$rows_left_out":188}
{"sheet":"Transport flerfunksjon","index":2,"n_rows":66,"n_cols":11,"rows_kept":66,"cut":false,"hidden":false,"merged":[]}
[]
[null,null,"Beregning for flerfunksjonelle byggningers transportutslipp"]
[]
[null,null,"Veiledning"]
[]
[null,null,null,"Fyll inn gule felter"]
[null,null,null,"Oransje felter gir inputverdier til ZERO-O Samlet beregning (steg 3)"]
[]
[null,null,"Dersom prosjektet ditt består av flere bygningstyper, skal disse ha tilpassede kravsnivå. Under kan du fylle inn opp til tre ulike bygningstyper."]
[null,null,"Fyll inn verdier fra resultatet av en ZERO-T V4 (publiseres 2025) beregning i tabellene under. "]
[null,null,"Feltet du skal hente ut data fra er nederst i ZERO-T beregningsverktøy og visgt i Figur 1."]
[null,null,"Lenke kommer: "]
[]
[null,null,"Velg bygningskategori fra nedtrekksmeny. Fyll inn oppvarmet BRA (m2)."]
[null,null,"Prosjektets verd i prosjekteringsfase: Bruk punkt 6. med alle prosjektets tiltak for mobilitet"]
[null,null,"Prosjektets verdi i drift: Bruk punkt 7. med egen RVU"]
[null,null,"FutureBuilt Kravsnivå: Bruk punkt 0 i tabellen \"FutureBuilts mål\""]
[null,null,"Velg flerfunksjonell i nedtrekksmenyen i områdeberegnigen og skriv over FB kravsnivå og Paris-kravet i tabellen for transportutslipp"]
[]
[null,null,"Figur 1: Figuren viser utklipp fra ZERO-T beregningsverktøy, hvor verdiene du skal bruke er nederst i beregningsverktøyet. "]
[]
[]
[]
[]
[]
[]
[]
[]
[]
[]
[]
[]
[]
[]
[]
[]
[]
[]
[null,null,"Første flerfunksjonelle bygning"]
[null,null,null,"Bygningstype 1","Bygningstype 2","Bygningstype 3",null,"Ferdigstillelsesår",2030]
[null,null,"Bygningstype","Kontor","Forretning/Næring",null,null,"Samlet areal",{"$f":"SUM(D42:F42)","v":1500},"m2"]
[null,null,"Oppvarmet bruksareal (BRA)",1000,500,null,null,"Prosjektets verdi",{"$f":"(D42*D43+E42*E43+F42*F43)/I41","v":166.66666666666666},"kgCO2e/m2","Input til Steg 3."]
[null,null,"Punkt 6 eller 7: Prosjektets verdi",200,100,null,null,"Pariskravet",{"$f":"I42*2","v":333.33333333333331},"kgCO2e/m2"]
[null,null,"Punkt 0: FutureBuilt kravsnivå",300,200,null,null,"FutureBuilts mål",{"$f":"(D42*D44+E42*E44+F42*F44)/I41","v":266.66666666666669},"kgCO2e/m2","Input til Steg 3."]
[]
[]
[]
[]
[null,null,"Andre flerfunksjonelle bygning"]
[null,null,null,"Bygningstype 1","Bygningstype 2","Bygningstype 3",null,"Ferdigstillelsesår",2035]
[null,null,"Bygningstype","Kontor","Forretning/Næring","Velg bygningstype",null,"Samlet areal",{"$f":"SUM(D52:F52)","v":6000},"m2"]
[null,null,"Oppvarmet bruksareal (BRA)",5000,1000,0,null,"Prosjektets verdi",{"$f":"(D52*D53+E52*E53+F52*F53)/I51","v":258.33333333333331},"kgCO2e/m2","Input til Steg 3."]
[null,null,"Punkt 6 eller 7: Prosjektets verdi",250,300,0,null,"Pariskravet",{"$f":"I52*2","v":516.66666666666663},"kgCO2e/m2"]
[null,null,"Punkt 0: FutureBuilt kravsnivå",300,300,0,null,"FutureBuilts mål",{"$f":"(D52*D54+E52*E54+F52*F54)/I51","v":300},"kgCO2e/m2","Input til Steg 3."]
[]
[]
[]
[]
[]
[]
{"$rows_left_out":7}
{"sheet":"Tabellverdier","index":3,"n_rows":42,"n_cols":8,"rows_kept":42,"cut":false,"hidden":false,"merged":[[9,2,9,3],[9,4,9,5],[9,6,9,7]]}
[]
[]
[null,"Beregning av Paris-kurven og linje for måloppnåelse"]
[]
[]
[]
[]
[]
[null,"Tabell 5: Beregner måloppnåelse opp mot pariskravet"]
[null,null,"Prosent",null,"Samlet måloppnåelse",null,"Krav"]
[null,null,"Paris-kravet","ZERO-ambisjon",null,{"$f":"\"Resultat: \"&TEXT('ZERO-O Samlet beregning'!K223,\"0,0%\")&\"\"","v":"Resultat: 22,7%"},null,"Områdemål: 25%"]
[null,2020,50,50,{"$f":"'ZERO-O Samlet beregning'!$J$234*100","v":22.717106412720611},{"$f":"C12+D12-E12","v":77.282893587279389},25,{"$f":"C12+D12-G12","v":75}]
[null,2021,47.5,47.5,{"$f":"E12-($E$12-$E$22)/10","v":21.581251092084582},{"$f":"C13+D13-E13","v":73.418748907915415},{"$f":"G12-($G$12-$G$22)/10","v":23.75},{"$f":"C13+D13-G13","v":71.25}]
[null,2022,44.999999999999993,44.999999999999993,{"$f":"E13-($E$12-$E$22)/10","v":20.445395771448553},69.554604228551426,{"$f":"G13-($G$12-$G$22)/10","v":22.5},67.499999999999986]
[null,2023,42.499999999999993,42.499999999999993,{"$f":"E14-($E$12-$E$22)/10","v":19.309540450812523},65.690459549187466,21.25,63.749999999999986]
[null,2024,39.999999999999993,39.999999999999993,18.173685130176494,61.826314869823491,20,59.999999999999986]
[null,2025,37.499999999999986,37.499999999999986,17.037829809540465,57.962170190459503,18.75,56.249999999999972]
[null,2026,34.999999999999986,34.999999999999986,15.901974488904434,54.098025511095535,17.5,52.499999999999972]
[null,2027,32.499999999999986,32.499999999999986,14.766119168268403,50.233880831731568,16.25,48.749999999999972]
[null,2028,29.999999999999982,29.999999999999982,13.630263847632373,46.369736152367594,15,44.999999999999964]
[null,2029,27.499999999999979,27.499999999999979,{"$f":"E20-($E$12-$E$22)/10","v":12.494408526996342},42.505591473003619,13.75,41.249999999999957]
[null,2030,25,25,{"$f":"E12/2","v":11.358553206360305},{"$f":"C22+D22-E22","v":38.641446793639695},{"$f":"G12/2","v":12.5},{"$f":"C22+D22-G22","v":37.5}]
[null,2031,24,24,{"$f":"E22-($E$22-$E$42)/20","v":10.904211078105893},37.095788921894105,{"$f":"G22-($G$22-$G$42)/20","v":12},36]
[null,2032,23,23,{"$f":"E23-($E$22-$E$42)/20","v":10.449868949851481},35.550131050148522,{"$f":"G23-($G$22-$G$42)/20","v":11.5},34.5]
[null,2033,21.999999999999996,21.999999999999996,9.9955268215970694,34.004473178402925,11,32.999999999999993]
[null,2034,20.999999999999996,20.999999999999996,9.5411846933426574,32.458815306657335,10.5,31.499999999999993]
[null,2035,19.999999999999996,19.999999999999996,9.0868425650882454,30.913157434911746,10,29.999999999999993]
[null,2036,18.999999999999993,18.999999999999993,8.6325004368338334,29.367499563166152,9.5,28.499999999999986]
[null,2037,17.999999999999993,17.999999999999993,8.1781583085794214,27.821841691420566,9,26.999999999999986]
[null,2038,16.999999999999993,16.999999999999993,7.7238161803250094,26.276183819674976,8.5,25.499999999999986]
[null,2039,15.999999999999993,15.999999999999993,7.2694740520705974,24.730525947929387,8,23.999999999999986]
[null,2040,14.999999999999991,14.999999999999991,6.8151319238161854,23.184868076183797,7.5,22.499999999999982]
[null,2041,13.999999999999989,13.999999999999989,6.3607897955617734,21.639210204438207,7,20.999999999999979]
[null,2042,12.999999999999989,12.999999999999989,5.9064476673073614,20.093552332692617,6.5,19.499999999999979]
[null,2043,11.999999999999989,11.999999999999989,5.4521055390529494,18.547894460947028,6,17.999999999999979]
[null,2044,10.999999999999991,10.999999999999991,4.9977634107985374,17.002236589201445,5.5,16.499999999999982]
[null,2045,9.9999999999999911,9.9999999999999911,4.5434212825441254,15.456578717455857,5,14.999999999999982]
[null,2046,8.9999999999999911,8.9999999999999911,4.0890791542897134,13.910920845710269,4.5,13.499999999999982]
[null,2047,7.999999999999992,7.999999999999992,3.6347370260353014,12.365262973964683,4,11.999999999999984]
[null,2048,6.999999999999992,6.999999999999992,3.1803948977808894,10.819605102219095,3.5,10.499999999999984]
[null,2049,5.999999999999992,5.999999999999992,2.7260527695264773,9.2739472304735067,3,8.999999999999984]
[null,2050,5,5,{"$f":"E12/10","v":2.2717106412720609},7.7282893587279391,{"$f":"G12/10","v":2.5},7.5]

{"sheet":"Lister","index":4,"n_rows":32,"n_cols":8,"rows_kept":32,"cut":false,"hidden":false,"merged":[]}
[]
[null,"Dette arket viser kun hva som inngår i nedtrekksmenyene i arket. "]
[null,"Bruker trenger ikke forholde seg til dette arket. "]
[]
[]
[]
[null,"Velg Prosjektfase",null,"Tidlig design",null,"Velg landskap",null,"Energi"]
[null,"Tidlig design",null,"Sen design",null,"Park",null,"Transport"]
[null,"Sen design",null,"Som bygget",null,"Gater",null,"VA"]
[null,"Som bygget",null,"I drift",null,"Torg",null,"Renovasjon"]
[null,null,null,null,null,"Idrettsanlegg",null,"IKT"]
[null,null,null,null,null,"Vannlandskap",null,"Annen infrastruktur"]
[null,"Velg bygningstype",null,null,null,"Gårdsrom/hager"]
[null,"Småhus",null,null,null,"Strandsone"]
[null,"Boligblokk"]
[null,"Barnehage"]
[null,"Skolebygg"]
[null,"Kontor"]
[null,"Universitet/Høyskole"]
[null,"Sykehus"]
[null,"Sykehjem"]
[null,"Hotellbygning"]
[null,"Idrettsbygning/Flerbrukshall"]
[null,"Forretning/Næring"]
[null,"Kulturbygning"]
[null,"Lett industri/Verksted"]
[null,"Flerfunksjonell"]
[]
[]
[]
[null,"Ja"]
[null,"Nei"]